program: Orca
programVersion: 5.0.4
elementType: S S P O O C C C C C C C C C C H H H H H H H H H H H H H H H H H H H H H H H
charge: 0
multiplicity: 1
keywords: wb97x-d3
keywords: def2-TZVPP
keywords: def2/J RIJCOSX
keywords: DEFGRID2
keywords: scfconv7
keywords: smallprint printgap noloewdin
keywords: NOSOSCF
formula: C10H23O2PS2
InChI: InChI=1/C10H23O2PS2/c1-6-9(4)14-13(11,12-8-3)15-10(5)7-2/h9-10H,6-8H2,1-5H3
38 atoms
S  1.429793 1.263566 -0.94914
S  -0.441394 -1.379144 -0.907071
P  -0.137362 0.399919 0.115115
O  -1.386199 1.29106 -0.34376
O  0.06366 0.304011 1.585941
C  2.96269 0.864905 0.007882
C  -2.085561 -2.039792 -0.360585
C  3.196043 -0.629872 0.1805
C  -2.306064 -2.035054 1.145108
C  3.044042 1.647154 1.30566
C  -3.220604 -1.38539 -1.126777
C  3.362595 -1.395632 -1.120274
C  -1.292513 -2.836326 1.941642
C  -1.622691 2.592106 0.239107
C  -3.109229 2.832317 0.285854
H  3.721143 1.254225 -0.678639
H  -1.993111 -3.078471 -0.692856
H  2.398433 -1.066642 0.786331
H  4.109188 -0.73473 0.774376
H  -2.363789 -1.008033 1.513026
H  -3.301389 -2.460479 1.306336
H  4.041865 1.529008 1.733228
H  2.322823 1.296525 2.040497
H  2.878271 2.711578 1.142541
H  -4.145703 -1.933384 -0.935845
H  -3.043426 -1.400875 -2.201666
H  -3.37838 -0.35237 -0.821533
H  3.566436 -2.448585 -0.923015
H  4.197341 -1.002427 -1.703736
H  2.470884 -1.347595 -1.745401
H  -1.275687 -3.879153 1.619484
H  -1.544073 -2.824839 3.00279
H  -0.282101 -2.442228 1.840283
H  -1.122562 3.338988 -0.379785
H  -1.195664 2.644304 1.24236
H  -3.555548 2.786171 -0.707964
H  -3.611008 2.109712 0.930042
H  -3.298091 3.827617 0.689694
elementType: S P O C H
totalener: -1683.32425043 hartree
nucrepener: 1598.59348562 hartree
electener: -3281.91773605 hartree
oneelecener: -5495.60024429 hartree
twoeener: 2213.68250824 hartree
cpcmener: -0.01922617 hartree
kineticenergy: 1678.52773974 hartree
xcener: -109.970217579225 hartree
chargesum: 0.0000000
charge: -0.215469 -0.207918 0.744642 -0.357779 -0.618967 0.100850 0.079798 -0.133156 -0.113134 -0.292798 -0.268471 -0.265143 -0.263900 0.031602 -0.257678 0.090021 0.092988 0.066129 0.086397 0.059816 0.087731 0.098559 0.097926 0.096742 0.099321 0.097070 0.083978 0.097383 0.088334 0.069491 0.085267 0.096285 0.067832 0.098635 0.098149 0.091098 0.087794 0.100578
qa: -0.2155 -0.2079 0.7446 -0.3578 -0.6190 0.1008 0.0798 -0.1332 -0.1131 -0.2928 -0.2685 -0.2651 -0.2639 0.0316 -0.2577 0.0900 0.0930 0.0661 0.0864 0.0598 0.0877 0.0986 0.0979 0.0967 0.0993 0.0971 0.0840 0.0974 0.0883 0.0695 0.0853 0.0963 0.0678 0.0986 0.0981 0.0911 0.0878 0.1006
va: 2.2862 2.2747 5.3804 2.0941 1.9575 3.7745 3.8231 3.8951 3.8587 3.9443 3.9500 3.9470 3.9612 3.8721 3.9473 1.0100 1.0080 1.0189 1.0081 1.0329 1.0051 1.0031 1.0209 1.0088 1.0037 1.0115 1.0109 1.0039 1.0031 1.0105 1.0024 1.0037 1.0125 0.9945 0.9992 1.0010 1.0043 1.0075
dispcorr: -0.019153650 hartree
energy: -1683.343404078557
dipole: -3.21447 2.79451 -0.41997 -4.61372 4.83769 0.22398 7.17610 -7.49508 -0.31898
magnitude: 0.57296 au
magnitude: 1.45636 debye
