program: Orca
programVersion: 5.0.4
elementType: S S P O O C C C C C C C C C C H H H H H H H H H H H H H H H H H H H H H H H
charge: 0
multiplicity: 1
keywords: wb97x-d3
keywords: def2-TZVPP
keywords: def2/J RIJCOSX
keywords: DEFGRID2
keywords: scfconv7
keywords: smallprint printgap noloewdin
keywords: NOSOSCF
formula: C10H23O2PS2
InChI: InChI=1/C10H23O2PS2/c1-6-9(4)14-13(11,12-8-3)15-10(5)7-2/h9-10H,6-8H2,1-5H3
38 atoms
S  1.612338 -0.292473 -0.444051
S  -1.579908 -0.985293 -0.880049
P  -0.289635 0.290736 0.124365
O  -0.460647 1.659212 -0.689113
O  -0.516282 0.382843 1.591818
C  2.627458 0.861274 0.599037
C  -1.825042 -2.333219 0.366285
C  3.816249 1.29948 -0.251762
C  -3.150965 -3.01817 0.050963
C  3.008482 0.17997 1.89856
C  -0.658528 -3.300424 0.346187
C  4.710629 2.301872 0.4641
C  -4.380069 -2.148877 0.256071
C  -1.536761 2.576304 -0.389426
C  -0.959904 3.951453 -0.172972
H  2.009015 1.738071 0.806086
H  -1.89733 -1.848024 1.340953
H  3.440966 1.747349 -1.174224
H  4.404769 0.424718 -0.544537
H  -3.130157 -3.419435 -0.966806
H  -3.212581 -3.886342 0.713814
H  2.127558 -0.162593 2.439196
H  3.540979 0.873844 2.551546
H  3.656381 -0.679973 1.721306
H  -0.544842 -3.768662 -0.632229
H  -0.824328 -4.091066 1.081312
H  0.281863 -2.81116 0.59886
H  4.136633 3.154088 0.833438
H  5.468225 2.68832 -0.218457
H  5.234054 1.858986 1.31159
H  -4.414034 -1.747821 1.27071
H  -5.290173 -2.72937 0.101252
H  -4.410968 -1.304997 -0.433953
H  -2.094218 2.250262 0.490715
H  -2.219805 2.562213 -1.239762
H  -1.769458 4.659729 0.007547
H  -0.296329 3.97298 0.692226
H  -0.4055 4.294939 -1.046853
elementType: S P O C H
totalener: -1683.32819678 hartree
nucrepener: 1545.42890275 hartree
electener: -3228.75709953 hartree
oneelecener: -5388.94961662 hartree
twoeener: 2160.19251709 hartree
cpcmener: -0.01964387 hartree
kineticenergy: 1678.52519725 hartree
xcener: -109.966294821264 hartree
chargesum: -0.0000000
charge: -0.192733 -0.202958 0.737963 -0.358859 -0.625111 0.076740 0.061322 -0.094076 -0.103107 -0.288187 -0.270432 -0.287575 -0.263675 0.040899 -0.248518 0.072116 0.081723 0.081378 0.075205 0.077742 0.077382 0.095247 0.100908 0.093838 0.091515 0.098248 0.086399 0.086503 0.096210 0.086262 0.082414 0.094061 0.076559 0.092492 0.102875 0.093143 0.086235 0.089849
qa: -0.1927 -0.2030 0.7380 -0.3589 -0.6251 0.0767 0.0613 -0.0941 -0.1031 -0.2882 -0.2704 -0.2876 -0.2637 0.0409 -0.2485 0.0721 0.0817 0.0814 0.0752 0.0777 0.0774 0.0952 0.1009 0.0938 0.0915 0.0982 0.0864 0.0865 0.0962 0.0863 0.0824 0.0941 0.0766 0.0925 0.1029 0.0931 0.0862 0.0898
va: 2.2811 2.3048 5.4017 2.0787 1.9591 3.8548 3.8397 3.8698 3.8530 3.9530 3.9346 3.9583 3.9489 3.8628 3.9500 1.0364 1.0426 1.0154 1.0115 1.0119 1.0062 1.0238 0.9996 1.0044 1.0078 1.0064 1.0264 0.9984 1.0039 0.9995 1.0013 1.0045 1.0111 1.0030 0.9931 1.0081 1.0062 1.0029
dispcorr: -0.016623100 hartree
energy: -1683.344819880455
dipole: 3.79239 -3.77154 0.02085 2.66574 -2.40379 0.26195 7.23651 -7.41222 -0.17571
magnitude: 0.31612 au
magnitude: 0.80350 debye
