program: Orca
programVersion: 5.0.4
elementType: S S P O O C C C C C C C C C C H H H H H H H H H H H H H H H H H H H H H H H
charge: 0
multiplicity: 1
keywords: wb97x-d3
keywords: def2-TZVPP
keywords: def2/J RIJCOSX
keywords: DEFGRID2
keywords: scfconv7
keywords: smallprint printgap noloewdin
keywords: NOSOSCF
formula: C10H23O2PS2
InChI: InChI=1/C10H23O2PS2/c1-6-9(4)14-13(11,12-8-3)15-10(5)7-2/h9-10H,6-8H2,1-5H3
38 atoms
S  1.490113 1.337108 -0.595456
S  -0.60935 -1.136299 -1.036428
P  -0.288571 0.549619 0.131271
O  -1.344946 1.611415 -0.431142
O  -0.332812 0.290117 1.59495
C  2.679316 0.053594 0.005955
C  -1.328536 -2.348818 0.165868
C  3.20736 0.409392 1.390751
C  -2.846936 -2.398162 0.079983
C  3.765923 -0.074657 -1.048036
C  -0.689724 -3.693748 -0.135308
C  3.992674 -0.732884 2.022558
C  -3.551606 -1.09135 0.399167
C  -1.662338 2.8182 0.299024
C  -3.13457 3.097531 0.145004
H  2.123383 -0.887444 0.053696
H  -1.023074 -2.016178 1.158428
H  2.370683 0.665573 2.042044
H  3.833861 1.302902 1.320062
H  -3.144556 -2.753438 -0.910643
H  -3.171368 -3.166196 0.789447
H  4.481672 -0.844357 -0.756879
H  4.317444 0.85883 -1.173995
H  3.352497 -0.360386 -2.014769
H  -0.918051 -4.034817 -1.146487
H  -1.074858 -4.442483 0.559209
H  0.393429 -3.659182 -0.0228
H  4.296996 -0.472011 3.036986
H  4.898625 -0.976951 1.466721
H  3.386388 -1.638887 2.08641
H  -4.630079 -1.243758 0.455785
H  -3.372265 -0.338748 -0.368592
H  -3.226812 -0.682877 1.357848
H  -1.061867 3.63191 -0.111195
H  -1.401272 2.705522 1.352651
H  -3.385544 4.009144 0.688561
H  -3.409562 3.245245 -0.899791
H  -3.73865 2.287054 0.554764
elementType: S P O C H
totalener: -1683.32759286 hartree
nucrepener: 1568.18128536 hartree
electener: -3251.50887822 hartree
oneelecener: -5434.46743963 hartree
twoeener: 2182.95856141 hartree
cpcmener: -0.01856257 hartree
kineticenergy: 1678.52768073 hartree
xcener: -109.968103583601 hartree
chargesum: -0.0000000
charge: -0.206038 -0.196748 0.742361 -0.361242 -0.619130 0.077514 0.057461 -0.099494 -0.098527 -0.273772 -0.276920 -0.280082 -0.278566 0.029616 -0.242089 0.062371 0.092927 0.070062 0.069514 0.069077 0.076284 0.099070 0.099367 0.102487 0.097571 0.096283 0.103305 0.095257 0.083315 0.085178 0.100847 0.070820 0.082244 0.103459 0.096444 0.094415 0.091051 0.084309
qa: -0.2060 -0.1967 0.7424 -0.3612 -0.6191 0.0775 0.0575 -0.0995 -0.0985 -0.2738 -0.2769 -0.2801 -0.2786 0.0296 -0.2421 0.0624 0.0929 0.0701 0.0695 0.0691 0.0763 0.0991 0.0994 0.1025 0.0976 0.0963 0.1033 0.0953 0.0833 0.0852 0.1008 0.0708 0.0822 0.1035 0.0964 0.0944 0.0911 0.0843
va: 2.2956 2.2823 5.4044 2.0869 1.9676 3.8336 3.8094 3.8929 3.8761 3.9262 3.9409 3.9546 3.9318 3.8679 3.9456 1.0399 1.0459 1.0314 1.0156 1.0126 1.0082 0.9996 1.0028 1.0115 1.0017 1.0025 1.0079 1.0036 1.0010 0.9993 1.0079 1.0155 1.0087 0.9924 1.0024 1.0086 1.0025 1.0045
dispcorr: -0.017739407 hartree
energy: -1683.345332268101
dipole: 0.29912 -0.20623 0.09289 -8.53906 8.12396 -0.41510 7.35616 -7.46481 -0.10865
magnitude: 0.43902 au
magnitude: 1.11590 debye
