program: Orca
programVersion: 5.0.4
elementType: S S P O O C C C C C C C C C C H H H H H H H H H H H H H H H H H H H H H H H
charge: 0
multiplicity: 1
keywords: wb97x-d3
keywords: def2-TZVPP
keywords: def2/J RIJCOSX
keywords: DEFGRID2
keywords: scfconv7
keywords: smallprint printgap noloewdin
keywords: NOSOSCF
formula: C10H23O2PS2
InChI: InChI=1/C10H23O2PS2/c1-6-9(4)14-13(11,12-8-3)15-10(5)7-2/h9-10H,6-8H2,1-5H3
38 atoms
S  1.460898 1.278685 -0.553143
S  -0.880395 -0.847895 -1.378499
P  -0.292246 0.416583 0.156244
O  -1.344297 1.618093 0.022053
O  -0.171602 -0.190523 1.509684
C  2.745315 0.204147 0.237653
C  -2.162461 -1.93622 -0.599289
C  4.047039 1.000865 0.188196
C  -1.501969 -3.046474 0.211569
C  2.827591 -1.145671 -0.445423
C  -3.235568 -1.16064 0.143812
C  5.201262 0.270338 0.859572
C  -2.49489 -4.094548 0.695172
C  -1.354477 2.697906 0.98311
C  -2.773893 3.175006 1.148285
H  2.445337 0.081737 1.279498
H  -2.614496 -2.378203 -1.492627
H  3.892827 1.962169 0.684623
H  4.307906 1.221607 -0.851022
H  -0.744424 -3.528492 -0.410574
H  -0.976006 -2.615245 1.064821
H  3.55652 -1.779909 0.061208
H  3.13092 -1.046483 -1.48861
H  1.874931 -1.673884 -0.418039
H  -4.070541 -1.82356 0.375203
H  -3.63012 -0.342915 -0.45769
H  -2.871438 -0.754827 1.087687
H  4.945785 -0.031582 1.87718
H  6.074844 0.919656 0.919684
H  5.49962 -0.623169 0.31097
H  -1.967433 -4.925608 1.164851
H  -3.081977 -4.504345 -0.129345
H  -3.190268 -3.696302 1.434635
H  -0.711584 3.49615 0.607989
H  -0.950442 2.361836 1.940012
H  -3.197957 3.51203 0.201806
H  -3.413189 2.392498 1.559188
H  -2.789392 4.018359 1.840131
elementType: S P O C H
totalener: -1683.32654207 hartree
nucrepener: 1554.11715566 hartree
electener: -3237.44369772 hartree
oneelecener: -5406.44317713 hartree
twoeener: 2168.99947941 hartree
cpcmener: -0.01876127 hartree
kineticenergy: 1678.51874895 hartree
xcener: -109.966994645224 hartree
chargesum: -0.0000000
charge: -0.206876 -0.191003 0.739397 -0.358276 -0.620280 0.056717 0.106463 -0.096321 -0.135887 -0.276940 -0.312390 -0.288688 -0.281514 0.032820 -0.248011 0.086744 0.097512 0.081958 0.077875 0.075166 0.079618 0.103398 0.092856 0.082047 0.108521 0.103967 0.088221 0.087755 0.096073 0.086169 0.095908 0.086453 0.086216 0.098917 0.096791 0.089506 0.087348 0.091771
qa: -0.2069 -0.1910 0.7394 -0.3583 -0.6203 0.0567 0.1065 -0.0963 -0.1359 -0.2769 -0.3124 -0.2887 -0.2815 0.0328 -0.2480 0.0867 0.0975 0.0820 0.0779 0.0752 0.0796 0.1034 0.0929 0.0820 0.1085 0.1040 0.0882 0.0878 0.0961 0.0862 0.0959 0.0865 0.0862 0.0989 0.0968 0.0895 0.0873 0.0918
va: 2.3083 2.2907 5.3792 2.0851 1.9569 3.8695 3.7864 3.8446 3.9034 3.9395 3.9399 3.9557 3.9619 3.8734 3.9586 1.0408 1.0102 1.0167 1.0110 1.0148 1.0277 1.0022 1.0081 1.0205 0.9984 1.0127 1.0173 0.9991 1.0039 0.9991 1.0037 0.9988 0.9982 0.9944 0.9984 1.0027 1.0044 1.0073
dispcorr: -0.017493014 hartree
energy: -1683.344035080663
dipole: 1.46195 -1.50919 -0.04724 -8.85026 8.90609 0.05583 8.89957 -8.88634 0.01323
magnitude: 0.07432 au
magnitude: 0.18891 debye
