program: Orca
programVersion: 5.0.4
elementType: S S P O O C C C C C C C C C C H H H H H H H H H H H H H H H H H H H H H H H
charge: 0
multiplicity: 1
keywords: wb97x-d3
keywords: def2-TZVPP
keywords: def2/J RIJCOSX
keywords: DEFGRID2
keywords: scfconv7
keywords: smallprint printgap noloewdin
keywords: NOSOSCF
formula: C10H23O2PS2
InChI: InChI=1/C10H23O2PS2/c1-6-9(4)14-13(11,12-8-3)15-10(5)7-2/h9-10H,6-8H2,1-5H3
38 atoms
S  1.47024 0.940528 -0.789347
S  -0.654821 -1.604572 -0.65143
P  -0.296395 0.297641 0.097729
O  -1.397726 1.168058 -0.672265
O  -0.306222 0.3597 1.584235
C  2.720858 0.442978 0.48204
C  -1.799777 -2.296738 0.627818
C  3.933214 1.34309 0.252567
C  -3.153124 -1.597114 0.665785
C  3.028579 -1.037525 0.385445
C  -1.893583 -3.786042 0.335141
C  5.046627 1.088729 1.259125
C  -3.942862 -1.615597 -0.631081
C  -1.41899 2.610847 -0.709616
C  -1.455738 3.26813 0.648407
H  2.285208 0.677153 1.454406
H  -1.301049 -2.159476 1.587677
H  3.617123 2.386263 0.323802
H  4.317398 1.199062 -0.761519
H  -3.732015 -2.089186 1.453552
H  -3.021093 -0.566749 1.002428
H  3.730481 -1.330332 1.167646
H  3.471519 -1.289048 -0.579416
H  2.133433 -1.645038 0.514939
H  -0.922121 -4.272225 0.423607
H  -2.286395 -3.995841 -0.659958
H  -2.563364 -4.251197 1.060593
H  4.678536 1.142181 2.28551
H  5.829463 1.840327 1.15276
H  5.513837 0.11363 1.121643
H  -3.420425 -1.089448 -1.429996
H  -4.905764 -1.123043 -0.491348
H  -4.146235 -2.629861 -0.975969
H  -2.319237 2.851703 -1.273033
H  -0.564542 2.965821 -1.289663
H  -2.278419 2.89313 1.257206
H  -0.524887 3.143552 1.20041
H  -1.608373 4.33872 0.505573
elementType: S P O C H
totalener: -1683.32508235 hartree
nucrepener: 1564.99621504 hartree
electener: -3248.32129739 hartree
oneelecener: -5428.25543043 hartree
twoeener: 2179.93413304 hartree
cpcmener: -0.01933776 hartree
kineticenergy: 1678.53089808 hartree
xcener: -109.972361985058 hartree
chargesum: 0.0000000
charge: -0.204294 -0.196831 0.738839 -0.350201 -0.624061 0.055679 0.059966 -0.097585 -0.121192 -0.282348 -0.294798 -0.288971 -0.271939 0.011203 -0.238785 0.090291 0.096649 0.082674 0.078132 0.084690 0.070528 0.102767 0.093191 0.089386 0.108406 0.099059 0.099792 0.088019 0.096342 0.086702 0.075273 0.096459 0.086827 0.107091 0.098587 0.093939 0.082139 0.098373
qa: -0.2043 -0.1968 0.7388 -0.3502 -0.6241 0.0557 0.0600 -0.0976 -0.1212 -0.2823 -0.2948 -0.2890 -0.2719 0.0112 -0.2388 0.0903 0.0966 0.0827 0.0781 0.0847 0.0705 0.1028 0.0932 0.0894 0.1084 0.0991 0.0998 0.0880 0.0963 0.0867 0.0753 0.0965 0.0868 0.1071 0.0986 0.0939 0.0821 0.0984
va: 2.3065 2.2889 5.3689 2.0864 1.9566 3.8561 3.8687 3.8520 3.8609 3.9385 3.9391 3.9565 3.9393 3.8947 3.8929 1.0413 1.0297 1.0162 1.0104 1.0084 1.0313 1.0015 1.0065 1.0254 1.0076 0.9988 1.0004 0.9988 1.0038 0.9991 1.0143 1.0042 0.9995 0.9901 0.9951 1.0047 1.0178 1.0090
dispcorr: -0.017444472 hartree
energy: -1683.342526822152
dipole: 1.73322 -1.55604 0.17718 -2.20893 2.41568 0.20675 6.90271 -7.07266 -0.16994
magnitude: 0.32097 au
magnitude: 0.81584 debye
