program: Orca
programVersion: 5.0.4
elementType: S S P O O C C C C C C C C C C H H H H H H H H H H H H H H H H H H H H H H H
charge: 0
multiplicity: 1
keywords: wb97x-d3
keywords: def2-TZVPP
keywords: def2/J RIJCOSX
keywords: DEFGRID2
keywords: scfconv7
keywords: smallprint printgap noloewdin
keywords: NOSOSCF
formula: C10H23O2PS2
InChI: InChI=1/C10H23O2PS2/c1-6-9(4)14-13(11,12-8-3)15-10(5)7-2/h9-10H,6-8H2,1-5H3
38 atoms
S  1.395376 -0.173171 -0.871326
S  -1.834521 -0.355646 -0.911376
P  -0.277814 0.566683 0.098708
O  -0.387763 2.077713 -0.419662
O  -0.263158 0.412116 1.578559
C  2.739257 0.45122 0.244143
C  -1.732132 -2.061121 -0.193706
C  3.917764 0.821068 -0.652694
C  -2.580107 -2.147503 1.06966
C  3.066076 -0.592194 1.294353
C  -2.158659 -3.02584 -1.287267
C  5.082422 1.415862 0.125798
C  -2.423428 -3.478171 1.791725
C  -0.990224 3.111778 0.388711
C  -2.495424 3.020314 0.425128
H  2.366337 1.360173 0.722217
H  -0.682149 -2.243065 0.050725
H  3.580232 1.541931 -1.400197
H  4.256163 -0.063162 -1.201113
H  -2.294436 -1.341618 1.747009
H  -3.629599 -1.980791 0.811574
H  3.474314 -1.496519 0.839998
H  2.183242 -0.869023 1.868224
H  3.804593 -0.207228 1.999681
H  -2.082196 -4.05421 -0.931892
H  -1.523713 -2.937764 -2.168253
H  -3.193039 -2.856997 -1.592499
H  4.763753 2.269755 0.726345
H  5.854939 1.76692 -0.559161
H  5.547064 0.691352 0.794358
H  -2.975129 -3.46636 2.732316
H  -1.377006 -3.679559 2.029415
H  -2.799973 -4.317758 1.207017
H  -0.671494 4.043606 -0.076763
H  -0.569798 3.084364 1.394973
H  -2.922889 3.03094 -0.577588
H  -2.842304 2.125912 0.943077
H  -2.88742 3.884153 0.963648
elementType: S P O C H
totalener: -1683.32722516 hartree
nucrepener: 1552.04189431 hartree
electener: -3235.36911947 hartree
oneelecener: -5402.19320315 hartree
twoeener: 2166.82408368 hartree
cpcmener: -0.01948199 hartree
kineticenergy: 1678.53210369 hartree
xcener: -109.969209194411 hartree
chargesum: 0.0000000
charge: -0.195223 -0.198573 0.733766 -0.368622 -0.622931 0.076147 0.072019 -0.098308 -0.098986 -0.290518 -0.277929 -0.286193 -0.283462 0.046684 -0.258239 0.078509 0.072174 0.080975 0.076023 0.072979 0.067858 0.092473 0.095741 0.100549 0.100360 0.102734 0.098899 0.086485 0.095876 0.086049 0.095382 0.086205 0.084828 0.105873 0.095168 0.090789 0.084405 0.100033
qa: -0.1952 -0.1986 0.7338 -0.3686 -0.6229 0.0761 0.0720 -0.0983 -0.0990 -0.2905 -0.2779 -0.2862 -0.2835 0.0467 -0.2582 0.0785 0.0722 0.0810 0.0760 0.0730 0.0679 0.0925 0.0957 0.1005 0.1004 0.1027 0.0989 0.0865 0.0959 0.0860 0.0954 0.0862 0.0848 0.1059 0.0952 0.0908 0.0844 0.1000
va: 2.2908 2.2886 5.3887 2.0796 1.9506 3.8451 3.8243 3.8731 3.8829 3.9531 3.9294 3.9555 3.9574 3.8575 3.9119 1.0353 1.0385 1.0159 1.0111 1.0324 1.0164 1.0046 1.0238 0.9999 0.9986 1.0111 1.0023 0.9990 1.0039 0.9998 1.0035 0.9990 1.0004 0.9900 1.0078 1.0029 1.0134 1.0114
dispcorr: -0.016928422 hartree
energy: -1683.344153585957
dipole: 5.18687 -4.85187 0.33500 -6.18484 6.30909 0.12426 8.64509 -8.76971 -0.12462
magnitude: 0.37841 au
magnitude: 0.96184 debye
