program: Orca
programVersion: 5.0.4
elementType: S S P O O C C C C C C C C C C H H H H H H H H H H H H H H H H H H H H H H H
charge: 0
multiplicity: 1
keywords: wb97x-d3
keywords: def2-TZVPP
keywords: def2/J RIJCOSX
keywords: DEFGRID2
keywords: scfconv7
keywords: smallprint printgap noloewdin
keywords: NOSOSCF
formula: C10H23O2PS2
InChI: InChI=1/C10H23O2PS2/c1-6-9(4)14-13(11,12-8-3)15-10(5)7-2/h9-10H,6-8H2,1-5H3
38 atoms
S  1.412434 0.015935 -1.04887
S  -1.824469 -0.497554 -0.88332
P  -0.27539 0.531422 0.040581
O  -0.584285 2.029688 -0.429172
O  -0.14507 0.308507 1.50471
C  2.731044 -0.121734 0.244418
C  -1.46131 -2.213835 -0.293024
C  3.545161 1.158235 0.362772
C  -2.14529 -2.478493 1.042898
C  3.589562 -1.315722 -0.137879
C  -1.892277 -3.162018 -1.399657
C  2.759722 2.387295 0.786455
C  -1.720446 -3.801056 1.667824
C  -1.641131 2.79376 0.196058
C  -1.130314 3.595411 1.367721
H  2.221704 -0.329455 1.186036
H  -0.375681 -2.280898 -0.175742
H  4.058454 1.350034 -0.583762
H  4.329521 0.959331 1.100067
H  -1.907376 -1.670021 1.734748
H  -3.22949 -2.460901 0.902061
H  4.071388 -1.177036 -1.107257
H  3.007539 -2.236035 -0.174494
H  4.378292 -1.447831 0.604927
H  -1.370793 -2.950552 -2.332725
H  -2.966148 -3.10239 -1.585828
H  -1.66119 -4.191209 -1.122754
H  2.062166 2.707695 0.013052
H  3.434489 3.223013 0.975464
H  2.194431 2.209019 1.702725
H  -2.014158 -4.662234 1.066968
H  -2.179031 -3.921565 2.65008
H  -0.638121 -3.843857 1.805807
H  -2.461564 2.138012 0.499835
H  -2.022562 3.447425 -0.587282
H  -1.93543 4.230511 1.739498
H  -0.80559 2.956335 2.187991
H  -0.302108 4.243557 1.0794
elementType: S P O C H
totalener: -1683.32754780 hartree
nucrepener: 1575.35282057 hartree
electener: -3258.68036838 hartree
oneelecener: -5448.88372604 hartree
twoeener: 2190.20335766 hartree
cpcmener: -0.01829174 hartree
kineticenergy: 1678.53284357 hartree
xcener: -109.969675592055 hartree
chargesum: -0.0000000
charge: -0.196296 -0.208771 0.739032 -0.361827 -0.617034 0.058956 0.079807 -0.100100 -0.105877 -0.276510 -0.276842 -0.274994 -0.282544 0.048865 -0.262597 0.091726 0.066639 0.068926 0.075858 0.074099 0.068673 0.097934 0.103055 0.096941 0.102316 0.099840 0.099812 0.070695 0.100338 0.081037 0.084331 0.095764 0.085450 0.088477 0.107061 0.102734 0.085499 0.089527
qa: -0.1963 -0.2088 0.7390 -0.3618 -0.6170 0.0590 0.0798 -0.1001 -0.1059 -0.2765 -0.2768 -0.2750 -0.2825 0.0489 -0.2626 0.0917 0.0666 0.0689 0.0759 0.0741 0.0687 0.0979 0.1031 0.0969 0.1023 0.0998 0.0998 0.0707 0.1003 0.0810 0.0843 0.0958 0.0854 0.0885 0.1071 0.1027 0.0855 0.0895
va: 2.2835 2.2933 5.3982 2.0787 1.9618 3.8115 3.8330 3.8772 3.8884 3.9378 3.9260 3.9314 3.9562 3.8575 3.9252 1.0447 1.0376 1.0127 1.0080 1.0330 1.0162 1.0017 1.0084 1.0022 1.0117 1.0026 0.9991 1.0197 1.0080 1.0073 1.0005 1.0034 0.9994 1.0075 0.9919 1.0097 1.0186 1.0011
dispcorr: -0.018000791 hartree
energy: -1683.345548593590
dipole: 5.45310 -5.25993 0.19317 -6.32792 5.97392 -0.35400 9.80738 -9.89448 -0.08710
magnitude: 0.41257 au
magnitude: 1.04868 debye
