program: Orca
programVersion: 5.0.4
elementType: S S P O O C C C C C C C C C C H H H H H H H H H H H H H H H H H H H H H H H
charge: 0
multiplicity: 1
keywords: wb97x-d3
keywords: def2-TZVPP
keywords: def2/J RIJCOSX
keywords: DEFGRID2
keywords: scfconv7
keywords: smallprint printgap noloewdin
keywords: NOSOSCF
formula: C10H23O2PS2
InChI: InChI=1/C10H23O2PS2/c1-6-9(4)14-13(11,12-8-3)15-10(5)7-2/h9-10H,6-8H2,1-5H3
38 atoms
S  1.428204 1.215284 -0.764102
S  -0.77398 -1.257699 -1.12285
P  -0.354617 0.450592 -0.014826
O  -1.431724 1.491146 -0.579522
O  -0.352841 0.206326 1.452879
C  2.666395 0.37685 0.328107
C  -1.702264 -2.276864 0.110857
C  3.923503 1.243667 0.294824
C  -3.09687 -1.715922 0.359581
C  2.898254 -1.052839 -0.11903
C  -1.707586 -3.693065 -0.442288
C  5.000493 0.735712 1.244024
C  -3.847183 -2.47057 1.448972
C  -1.39105 2.912905 -0.333467
C  -1.304606 3.292085 1.12541
H  2.249663 0.39709 1.336213
H  -1.118853 -2.253291 1.03236
H  3.658249 2.266487 0.571745
H  4.319222 1.284992 -0.72417
H  -3.022533 -0.667352 0.654215
H  -3.665301 -1.735789 -0.574061
H  3.594916 -1.552119 0.556176
H  3.315344 -1.090499 -1.126412
H  1.976526 -1.633178 -0.113643
H  -2.167426 -4.37072 0.27759
H  -0.697045 -4.057514 -0.62701
H  -2.273859 -3.762954 -1.372644
H  4.616789 0.630178 2.260614
H  5.834636 1.437053 1.27904
H  5.403082 -0.229539 0.936813
H  -4.795845 -1.978831 1.667066
H  -3.273679 -2.500554 2.377477
H  -4.07425 -3.497993 1.1637
H  -2.315743 3.287648 -0.769834
H  -0.563082 3.348294 -0.896843
H  -0.343508 3.034346 1.569209
H  -1.419202 4.373883 1.204246
H  -2.098225 2.829755 1.712217
elementType: S P O C H
totalener: -1683.32524494 hartree
nucrepener: 1555.76719790 hartree
electener: -3239.09244284 hartree
oneelecener: -5409.73728169 hartree
twoeener: 2170.64483884 hartree
cpcmener: -0.01927486 hartree
kineticenergy: 1678.52264501 hartree
xcener: -109.969550370438 hartree
chargesum: -0.0000000
charge: -0.205240 -0.193291 0.738372 -0.354846 -0.623612 0.058480 0.069790 -0.097222 -0.103161 -0.279978 -0.291251 -0.288427 -0.285119 0.007341 -0.239660 0.089156 0.085162 0.081145 0.078554 0.070303 0.068705 0.102678 0.092267 0.088973 0.101562 0.105609 0.100971 0.087584 0.096026 0.086140 0.095437 0.087055 0.086478 0.109223 0.099685 0.082618 0.097914 0.094579
qa: -0.2052 -0.1933 0.7384 -0.3548 -0.6236 0.0585 0.0698 -0.0972 -0.1032 -0.2800 -0.2913 -0.2884 -0.2851 0.0073 -0.2397 0.0892 0.0852 0.0811 0.0786 0.0703 0.0687 0.1027 0.0923 0.0890 0.1016 0.1056 0.1010 0.0876 0.0960 0.0861 0.0954 0.0871 0.0865 0.1092 0.0997 0.0826 0.0979 0.0946
va: 2.3033 2.2844 5.3636 2.0904 1.9539 3.8525 3.8221 3.8553 3.8758 3.9384 3.9345 3.9556 3.9566 3.8973 3.8912 1.0425 1.0395 1.0167 1.0104 1.0314 1.0186 1.0021 1.0077 1.0242 0.9976 1.0075 1.0018 0.9989 1.0036 0.9999 1.0037 0.9996 0.9990 0.9899 0.9929 1.0174 1.0092 1.0061
dispcorr: -0.016981378 hartree
energy: -1683.342226320607
dipole: 3.07295 -2.75262 0.32033 -6.52999 6.67716 0.14716 10.65747 -10.73301 -0.07554
magnitude: 0.36052 au
magnitude: 0.91638 debye
