program: Orca
programVersion: 5.0.4
elementType: S S P O O C C C C C C C C C C H H H H H H H H H H H H H H H H H H H H H H H
charge: 0
multiplicity: 1
keywords: wb97x-d3
keywords: def2-TZVPP
keywords: def2/J RIJCOSX
keywords: DEFGRID2
keywords: scfconv7
keywords: smallprint printgap noloewdin
keywords: NOSOSCF
formula: C10H23O2PS2
InChI: InChI=1/C10H23O2PS2/c1-6-9(4)14-13(11,12-8-3)15-10(5)7-2/h9-10H,6-8H2,1-5H3
38 atoms
S  1.595077 0.862601 -0.790635
S  -0.67126 -1.545375 -0.628707
P  -0.218564 0.347458 0.084551
O  -1.239224 1.277056 -0.727501
O  -0.247241 0.47185 1.56596
C  2.789249 0.346739 0.52636
C  -1.85092 -2.161727 0.658478
C  4.060759 1.158559 0.289377
C  -3.173711 -1.406176 0.670846
C  3.003948 -1.153182 0.504414
C  -2.001091 -3.651769 0.398053
C  5.124071 0.895209 1.346941
C  -3.968778 -1.447417 -0.622464
C  -1.308761 2.693626 -0.457444
C  -2.423706 3.013817 0.507549
H  2.348667 0.651702 1.476739
H  -1.351941 -2.021866 1.618058
H  3.808058 2.221251 0.293904
H  4.4660 0.935061 -0.70186
H  -3.76882 -1.8426 1.47972
H  -2.998494 -0.368874 0.964413
H  2.069472 -1.696611 0.641902
H  3.670374 -1.452803 1.314552
H  3.447942 -1.476598 -0.438244
H  -2.392928 -3.86791 -0.596183
H  -2.695639 -4.07337 1.126964
H  -1.050757 -4.174413 0.506606
H  4.730313 1.043399 2.354414
H  5.961835 1.581402 1.218185
H  5.523326 -0.117287 1.289375
H  -3.418711 -0.997871 -1.450024
H  -4.900075 -0.89152 -0.508964
H  -4.233964 -2.465635 -0.910138
H  -1.48038 3.166832 -1.423946
H  -0.350496 3.062554 -0.082098
H  -2.247104 2.574339 1.489222
H  -2.484975 4.095543 0.633653
H  -3.388084 2.666225 0.135984
elementType: S P O C H
totalener: -1683.32736057 hartree
nucrepener: 1561.03558281 hartree
electener: -3244.36294338 hartree
oneelecener: -5420.24248753 hartree
twoeener: 2175.87954415 hartree
cpcmener: -0.01879644 hartree
kineticenergy: 1678.53592783 hartree
xcener: -109.971053232848 hartree
chargesum: -0.0000000
charge: -0.206883 -0.195246 0.738410 -0.357710 -0.623225 0.054890 0.056810 -0.099586 -0.107920 -0.282083 -0.295088 -0.287734 -0.273261 0.051054 -0.260124 0.088927 0.097261 0.082263 0.078661 0.084484 0.064122 0.089255 0.102498 0.092875 0.099291 0.100335 0.108991 0.087620 0.096061 0.086378 0.076560 0.096553 0.087692 0.107170 0.085898 0.084201 0.101153 0.089447
qa: -0.2069 -0.1952 0.7384 -0.3577 -0.6232 0.0549 0.0568 -0.0996 -0.1079 -0.2821 -0.2951 -0.2877 -0.2733 0.0511 -0.2601 0.0889 0.0973 0.0823 0.0787 0.0845 0.0641 0.0893 0.1025 0.0929 0.0993 0.1003 0.1090 0.0876 0.0961 0.0864 0.0766 0.0966 0.0877 0.1072 0.0859 0.0842 0.1012 0.0894
va: 2.3010 2.2896 5.3819 2.0720 1.9595 3.8546 3.8702 3.8557 3.8686 3.9386 3.9397 3.9551 3.9383 3.8603 3.9326 1.0421 1.0292 1.0160 1.0102 1.0094 1.0254 1.0238 1.0019 1.0067 0.9986 1.0002 1.0076 0.9991 1.0038 0.9994 1.0139 1.0042 0.9998 0.9913 1.0102 1.0167 1.0094 1.0017
dispcorr: -0.017538972 hartree
energy: -1683.344899542558
dipole: -0.64659 0.69125 0.04466 -2.95134 3.00783 0.05648 7.70619 -7.66042 0.04577
magnitude: 0.08532 au
magnitude: 0.21687 debye
