program: Orca
programVersion: 5.0.4
elementType: S S P O O C C C C C C C C C C H H H H H H H H H H H H H H H H H H H H H H H
charge: 0
multiplicity: 1
keywords: wb97x-d3
keywords: def2-TZVPP
keywords: def2/J RIJCOSX
keywords: DEFGRID2
keywords: scfconv7
keywords: smallprint printgap noloewdin
keywords: NOSOSCF
formula: C10H23O2PS2
InChI: InChI=1/C10H23O2PS2/c1-6-9(4)14-13(11,12-8-3)15-10(5)7-2/h9-10H,6-8H2,1-5H3
38 atoms
S  1.600282 1.104211 -0.748571
S  -0.670946 -1.289149 -0.987276
P  -0.213587 0.457969 0.033094
O  -1.230931 1.518292 -0.606622
O  -0.237317 0.328454 1.515247
C  2.80586 0.302777 0.405561
C  -1.800467 -2.135504 0.210543
C  4.099122 1.108083 0.297232
C  -3.160607 -1.452387 0.276825
C  2.975181 -1.168724 0.083103
C  -1.870591 -3.585108 -0.244792
C  5.156924 0.638824 1.287038
C  -4.078288 -2.072241 1.322944
C  -1.313342 2.863122 -0.081403
C  -2.41901 2.984336 0.936049
H  2.39643 0.424558 1.409678
H  -1.308443 -2.088325 1.183472
H  3.879436 2.16218 0.482876
H  4.49188 1.042527 -0.721871
H  -3.028671 -0.395336 0.516956
H  -3.631725 -1.489712 -0.709477
H  3.656298 -1.63602 0.796119
H  3.381111 -1.313114 -0.919379
H  2.030748 -1.70817 0.144527
H  -2.449453 -4.170665 0.470057
H  -0.880773 -4.037812 -0.304509
H  -2.35193 -3.681095 -1.219599
H  4.773166 0.64133 2.309496
H  6.021925 1.301912 1.259504
H  5.514059 -0.367428 1.066606
H  -5.00167 -1.497787 1.406762
H  -3.607934 -2.080235 2.308971
H  -4.358051 -3.097786 1.078497
H  -1.504893 3.498786 -0.9456
H  -0.353279 3.169698 0.342063
H  -3.381673 2.689244 0.516779
H  -2.222634 2.380809 1.822427
H  -2.499913 4.025633 1.251736
elementType: S P O C H
totalener: -1683.32774852 hartree
nucrepener: 1550.07171900 hartree
electener: -3233.39946752 hartree
oneelecener: -5398.27308165 hartree
twoeener: 2164.87361413 hartree
cpcmener: -0.01892805 hartree
kineticenergy: 1678.51331603 hartree
xcener: -109.965375500148 hartree
chargesum: -0.0000000
charge: -0.204453 -0.189312 0.731872 -0.360214 -0.623066 0.055159 0.061233 -0.097276 -0.081368 -0.280838 -0.289049 -0.287785 -0.285350 0.049611 -0.261469 0.087404 0.087119 0.081418 0.078199 0.057311 0.068331 0.103022 0.092355 0.088698 0.101594 0.104862 0.101161 0.087052 0.095990 0.086152 0.095231 0.087158 0.087583 0.106501 0.087222 0.089347 0.085474 0.103121
qa: -0.2045 -0.1893 0.7319 -0.3602 -0.6231 0.0552 0.0612 -0.0973 -0.0814 -0.2808 -0.2890 -0.2878 -0.2853 0.0496 -0.2615 0.0874 0.0871 0.0814 0.0782 0.0573 0.0683 0.1030 0.0924 0.0887 0.1016 0.1049 0.1012 0.0871 0.0960 0.0862 0.0952 0.0872 0.0876 0.1065 0.0872 0.0893 0.0855 0.1031
va: 2.3040 2.2879 5.3852 2.0730 1.9582 3.8599 3.8351 3.8557 3.8855 3.9350 3.9341 3.9549 3.9600 3.8651 3.9242 1.0419 1.0392 1.0163 1.0106 1.0226 1.0195 1.0025 1.0075 1.0248 0.9974 1.0085 1.0017 0.9991 1.0037 0.9998 1.0037 0.9994 0.9991 0.9916 1.0099 1.0024 1.0183 1.0091
dispcorr: -0.017011469 hartree
energy: -1683.344759990370
dipole: -0.57168 0.64193 0.07025 -6.31737 6.32124 0.00387 10.63943 -10.58673 0.05270
magnitude: 0.08791 au
magnitude: 0.22345 debye
