program: Orca
programVersion: 5.0.4
elementType: S S P O O C C C C C C C C C C H H H H H H H H H H H H H H H H H H H H H H H
charge: 0
multiplicity: 1
keywords: wb97x-d3
keywords: def2-TZVPP
keywords: def2/J RIJCOSX
keywords: DEFGRID2
keywords: scfconv7
keywords: smallprint printgap noloewdin
keywords: NOSOSCF
formula: C10H23O2PS2
InChI: InChI=1/C10H23O2PS2/c1-6-9(4)14-13(11,12-8-3)15-10(5)7-2/h9-10H,6-8H2,1-5H3
38 atoms
S  1.597967 -0.100847 -0.805633
S  -1.631271 -0.852566 -0.838842
P  -0.18915 0.221791 0.197025
O  -0.553844 1.723268 -0.227938
O  -0.126481 -0.050492 1.657892
C  2.849458 0.349955 0.482215
C  -1.591192 -2.484018 0.033026
C  2.851798 1.847333 0.76531
C  -2.963391 -3.128934 -0.132958
C  4.178384 -0.166593 -0.046648
C  -0.474569 -3.354989 -0.507718
C  3.839875 2.241111 1.854871
C  -4.101257 -2.389296 0.550876
C  -1.726287 2.382155 0.30145
C  -1.480736 3.868825 0.293881
H  2.578946 -0.202189 1.383898
H  -1.424813 -2.26813 1.08978
H  1.855015 2.162691 1.076904
H  3.075032 2.388829 -0.157464
H  -3.181745 -3.270139 -1.195633
H  -2.881931 -4.133661 0.291739
H  4.956209 -0.026492 0.704428
H  4.486614 0.364693 -0.948804
H  4.137095 -1.232282 -0.272461
H  -0.604375 -3.55439 -1.57219
H  -0.468818 -4.312593 0.017068
H  0.5033 -2.895929 -0.366596
H  3.665967 1.676356 2.77205
H  3.733813 3.298769 2.098349
H  4.875237 2.081699 1.556332
H  -5.026954 -2.961207 0.479874
H  -4.287587 -1.411924 0.105006
H  -3.890618 -2.234488 1.6106
H  -1.93359 2.031806 1.314495
H  -2.581957 2.12552 -0.325505
H  -0.652437 4.141878 0.948009
H  -1.268907 4.236314 -0.710605
H  -2.373996 4.3805 0.65368
elementType: S P O C H
totalener: -1683.32861098 hartree
nucrepener: 1550.38956933 hartree
electener: -3233.71818032 hartree
oneelecener: -5398.92997588 hartree
twoeener: 2165.21179557 hartree
cpcmener: -0.01947208 hartree
kineticenergy: 1678.52783988 hartree
xcener: -109.967706002536 hartree
chargesum: 0.0000000
charge: -0.190077 -0.209439 0.740824 -0.354355 -0.624414 0.063836 0.064386 -0.091199 -0.104418 -0.290033 -0.271454 -0.287365 -0.265810 0.033051 -0.247820 0.087226 0.082723 0.059980 0.069036 0.077661 0.077591 0.101816 0.101946 0.104620 0.090426 0.097899 0.090164 0.087493 0.095596 0.088242 0.094208 0.077313 0.083079 0.100244 0.098978 0.088483 0.089062 0.090500
qa: -0.1901 -0.2094 0.7408 -0.3544 -0.6244 0.0638 0.0644 -0.0912 -0.1044 -0.2900 -0.2715 -0.2874 -0.2658 0.0331 -0.2478 0.0872 0.0827 0.0600 0.0690 0.0777 0.0776 0.1018 0.1019 0.1046 0.0904 0.0979 0.0902 0.0875 0.0956 0.0882 0.0942 0.0773 0.0831 0.1002 0.0990 0.0885 0.0891 0.0905
va: 2.2951 2.3017 5.3908 2.0805 1.9705 3.8411 3.8341 3.8711 3.8547 3.9324 3.9370 3.9637 3.9511 3.8695 3.9638 1.0370 1.0422 1.0320 1.0185 1.0114 1.0065 0.9970 1.0015 1.0096 1.0078 1.0063 1.0235 0.9991 1.0036 0.9982 1.0046 1.0100 1.0011 0.9968 0.9925 1.0044 1.0032 1.0067
dispcorr: -0.016665247 hartree
energy: -1683.345276228301
dipole: 3.08522 -3.17147 -0.08625 0.71771 -0.72440 -0.00669 7.49626 -7.58309 -0.08684
magnitude: 0.12257 au
magnitude: 0.31156 debye
