program: Orca
programVersion: 5.0.4
elementType: S S P O O C C C C C C C C C C H H H H H H H H H H H H H H H H H H H H H H H
charge: 0
multiplicity: 1
keywords: wb97x-d3
keywords: def2-TZVPP
keywords: def2/J RIJCOSX
keywords: DEFGRID2
keywords: scfconv7
keywords: smallprint printgap noloewdin
keywords: NOSOSCF
formula: C10H23O2PS2
InChI: InChI=1/C10H23O2PS2/c1-6-9(4)14-13(11,12-8-3)15-10(5)7-2/h9-10H,6-8H2,1-5H3
38 atoms
S  1.593434 -0.211574 -0.592955
S  -1.634398 -0.535019 -0.986711
P  -0.21413 0.509146 0.113816
O  -0.274115 1.980157 -0.518938
O  -0.392475 0.451252 1.589596
C  2.763406 0.645459 0.565328
C  -1.991603 -1.966823 0.133506
C  3.977774 1.069735 -0.25609
C  -3.390186 -2.457566 -0.23464
C  3.09055 -0.270082 1.729383
C  -0.918695 -3.029609 0.009305
C  5.012283 1.821528 0.570341
C  -3.877548 -3.566139 0.688464
C  -1.02503 3.041332 0.109694
C  -2.51876 2.875128 -0.025763
H  2.259804 1.543727 0.930328
H  -2.013593 -1.566446 1.148306
H  3.641046 1.705568 -1.077514
H  4.442362 0.189619 -0.710873
H  -4.087735 -1.618601 -0.181519
H  -3.398512 -2.810381 -1.270116
H  2.187436 -0.588899 2.247636
H  3.718783 0.246111 2.457285
H  3.624609 -1.161382 1.396005
H  -0.877865 -3.436335 -1.002232
H  -1.116975 -3.852333 0.697931
H  0.067647 -2.637971 0.256535
H  4.56543 2.667882 1.095844
H  5.799127 2.214699 -0.074359
H  5.491204 1.182834 1.312641
H  -4.915056 -3.815611 0.46425
H  -3.832044 -3.260782 1.735524
H  -3.295098 -4.48114 0.581189
H  -0.692341 3.94621 -0.396681
H  -0.733384 3.124117 1.157967
H  -2.819325 2.764427 -1.067636
H  -2.893204 2.020391 0.537303
H  -3.006193 3.767738 0.368681
elementType: S P O C H
totalener: -1683.32630544 hartree
nucrepener: 1545.16917232 hartree
electener: -3228.49547775 hartree
oneelecener: -5388.43117484 hartree
twoeener: 2159.93569709 hartree
cpcmener: -0.01933109 hartree
kineticenergy: 1678.52615897 hartree
xcener: -109.968174725566 hartree
chargesum: -0.0000000
charge: -0.193109 -0.199958 0.741313 -0.366975 -0.625330 0.072096 0.056488 -0.094501 -0.096189 -0.291032 -0.279681 -0.286990 -0.287509 0.043043 -0.257067 0.077050 0.086705 0.081484 0.073535 0.082509 0.078598 0.095665 0.101703 0.094318 0.092684 0.102455 0.085044 0.086281 0.096195 0.086126 0.095587 0.087107 0.085929 0.106105 0.095799 0.089830 0.084489 0.100204
qa: -0.1931 -0.2000 0.7413 -0.3670 -0.6253 0.0721 0.0565 -0.0945 -0.0962 -0.2910 -0.2797 -0.2870 -0.2875 0.0430 -0.2571 0.0771 0.0867 0.0815 0.0735 0.0825 0.0786 0.0957 0.1017 0.0943 0.0927 0.1025 0.0850 0.0863 0.0962 0.0861 0.0956 0.0871 0.0859 0.1061 0.0958 0.0898 0.0845 0.1002
va: 2.2920 2.2954 5.3781 2.0762 1.9515 3.8535 3.8533 3.8737 3.8527 3.9521 3.9358 3.9562 3.9559 3.8621 3.9149 1.0350 1.0435 1.0153 1.0116 1.0155 1.0105 1.0227 0.9998 1.0041 1.0074 1.0023 1.0289 0.9988 1.0040 0.9995 1.0038 0.9990 1.0000 0.9898 1.0064 1.0041 1.0127 1.0110
dispcorr: -0.016884899 hartree
energy: -1683.343190335811
dipole: 2.39705 -2.31549 0.08156 -4.38084 4.65890 0.27806 8.36649 -8.38144 -0.01496
magnitude: 0.29016 au
magnitude: 0.73752 debye
