program: Orca
programVersion: 5.0.4
elementType: S S P O O C C C C C C C C C C H H H H H H H H H H H H H H H H H H H H H H H
charge: 0
multiplicity: 1
keywords: wb97x-d3
keywords: def2-TZVPP
keywords: def2/J RIJCOSX
keywords: DEFGRID2
keywords: scfconv7
keywords: smallprint printgap noloewdin
keywords: NOSOSCF
formula: C10H23O2PS2
InChI: InChI=1/C10H23O2PS2/c1-6-9(4)14-13(11,12-8-3)15-10(5)7-2/h9-10H,6-8H2,1-5H3
38 atoms
S  1.656763 1.196164 -0.829433
S  -0.286004 -1.441918 -0.436149
P  -0.122249 0.562218 0.039162
O  -1.197452 1.219062 -0.953479
O  -0.307989 0.877926 1.482125
C  2.937371 0.974247 0.491557
C  -1.816231 -1.866409 0.525437
C  3.023161 -0.449929 1.02346
C  -2.703195 -2.748129 -0.343615
C  2.802902 2.018565 1.583777
C  -1.422033 -2.51756 1.836029
C  3.421237 -1.485331 -0.012562
C  -3.280136 -2.043362 -1.558699
C  -1.627559 2.584578 -0.754071
C  -2.890465 2.639992 0.067699
H  3.84539 1.184985 -0.082372
H  -2.345237 -0.931708 0.72601
H  2.084416 -0.728253 1.506705
H  3.772254 -0.438248 1.821042
H  -2.155267 -3.646076 -0.645602
H  -3.522266 -3.095218 0.294619
H  1.916708 1.860464 2.193402
H  2.76175 3.026243 1.171501
H  3.673861 1.964323 2.239964
H  -0.877719 -3.449063 1.67358
H  -2.317073 -2.747553 2.41815
H  -0.796089 -1.856921 2.434928
H  4.408106 -1.268552 -0.425273
H  2.717772 -1.529952 -0.844077
H  3.462339 -2.47979 0.433112
H  -3.96656 -2.700254 -2.093941
H  -2.504758 -1.735574 -2.260605
H  -3.837589 -1.150189 -1.269332
H  -1.793905 2.98427 -1.754247
H  -0.832129 3.178354 -0.29549
H  -3.239459 3.672204 0.124664
H  -3.684501 2.045111 -0.385354
H  -2.726199 2.286625 1.085405
elementType: S P O C H
totalener: -1683.32650374 hartree
nucrepener: 1592.81322341 hartree
electener: -3276.13972715 hartree
oneelecener: -5483.92785565 hartree
twoeener: 2207.78812850 hartree
cpcmener: -0.01884245 hartree
kineticenergy: 1678.53460677 hartree
xcener: -109.970415590719 hartree
chargesum: 0.0000000
charge: -0.211070 -0.202004 0.735713 -0.362424 -0.621301 0.097431 0.097597 -0.128089 -0.103337 -0.290659 -0.276926 -0.267549 -0.266658 0.047298 -0.256856 0.089487 0.062488 0.064294 0.087017 0.075808 0.076367 0.097498 0.097039 0.098626 0.093682 0.097246 0.093738 0.089940 0.068559 0.097943 0.096783 0.077559 0.078593 0.106883 0.088243 0.099195 0.087832 0.084015
qa: -0.2111 -0.2020 0.7357 -0.3624 -0.6213 0.0974 0.0976 -0.1281 -0.1033 -0.2907 -0.2769 -0.2675 -0.2667 0.0473 -0.2569 0.0895 0.0625 0.0643 0.0870 0.0758 0.0764 0.0975 0.0970 0.0986 0.0937 0.0972 0.0937 0.0899 0.0686 0.0979 0.0968 0.0776 0.0786 0.1069 0.0882 0.0992 0.0878 0.0840
va: 2.2922 2.2790 5.3929 2.0701 1.9475 3.7816 3.8308 3.8846 3.8733 3.9454 3.9561 3.9441 3.9412 3.8647 3.9346 1.0089 1.0373 1.0218 1.0079 1.0118 1.0080 1.0211 1.0093 1.0034 1.0051 1.0048 1.0178 1.0038 1.0106 1.0039 1.0056 1.0146 1.0019 0.9920 1.0061 1.0091 1.0026 1.0185
dispcorr: -0.018705003 hartree
energy: -1683.345208739447
dipole: -4.88319 4.74726 -0.13593 -5.88442 5.87428 -0.01015 6.69386 -6.80193 -0.10807
magnitude: 0.17396 au
magnitude: 0.44216 debye
