program: Orca
programVersion: 5.0.4
elementType: S S P O O C C C C C C C C C C H H H H H H H H H H H H H H H H H H H H H H H
charge: 0
multiplicity: 1
keywords: wb97x-d3
keywords: def2-TZVPP
keywords: def2/J RIJCOSX
keywords: DEFGRID2
keywords: scfconv7
keywords: smallprint printgap noloewdin
keywords: NOSOSCF
formula: C10H23O2PS2
InChI: InChI=1/C10H23O2PS2/c1-6-9(4)14-13(11,12-8-3)15-10(5)7-2/h9-10H,6-8H2,1-5H3
38 atoms
S  1.604464 1.598731 0.055683
S  -0.342865 -1.06153 -0.305574
P  -0.234569 0.804269 0.600494
O  -1.221141 1.78717 -0.188532
O  -0.589023 0.796176 2.040974
C  2.909304 0.466174 0.733416
C  -1.825093 -1.777833 0.550782
C  3.332461 -0.582126 -0.286409
C  -2.592675 -2.62489 -0.4576
C  2.565978 -0.12991 2.085324
C  -1.380632 -2.573474 1.762047
C  3.869468 -0.014713 -1.589126
C  -3.220945 -1.841594 -1.597849
C  -1.23589 1.942335 -1.618831
C  -2.649298 2.216868 -2.063878
H  3.731812 1.174006 0.868257
H  -2.455452 -0.942156 0.86299
H  2.50189 -1.265062 -0.479841
H  4.113465 -1.182061 0.19134
H  -1.944058 -3.414509 -0.848425
H  -3.380058 -3.135591 0.104643
H  3.457859 -0.617107 2.483182
H  1.787392 -0.889898 2.015121
H  2.252872 0.626622 2.802735
H  -0.836878 -1.954521 2.473298
H  -0.740334 -3.409107 1.47646
H  -2.254481 -2.980389 2.275494
H  4.710572 0.659404 -1.411991
H  3.107496 0.540698 -2.138661
H  4.222253 -0.814715 -2.241492
H  -3.816125 -2.498708 -2.232939
H  -2.4712 -1.366128 -2.231378
H  -3.884546 -1.060757 -1.221302
H  -0.853261 1.041758 -2.105087
H  -0.576078 2.771111 -1.882294
H  -2.661654 2.356279 -3.145709
H  -3.313406 1.385208 -1.825324
H  -3.047009 3.123456 -1.606907
elementType: S P O C H
totalener: -1683.32453769 hartree
nucrepener: 1590.27914469 hartree
electener: -3273.60368238 hartree
oneelecener: -5478.32279995 hartree
twoeener: 2204.71911757 hartree
cpcmener: -0.02344437 hartree
kineticenergy: 1678.53013065 hartree
xcener: -109.972666935916 hartree
chargesum: -0.0000000
charge: -0.204370 -0.226539 0.734737 -0.358600 -0.620525 0.051491 0.110952 -0.119461 -0.100642 -0.265578 -0.287639 -0.261883 -0.286236 0.016136 -0.243239 0.100205 0.072941 0.078436 0.082012 0.076909 0.078165 0.105500 0.073858 0.104746 0.095196 0.091720 0.101035 0.085821 0.073906 0.093852 0.101983 0.080101 0.084499 0.102047 0.111650 0.089887 0.083070 0.093860
qa: -0.2044 -0.2265 0.7347 -0.3586 -0.6205 0.0515 0.1110 -0.1195 -0.1006 -0.2656 -0.2876 -0.2619 -0.2862 0.0161 -0.2432 0.1002 0.0729 0.0784 0.0820 0.0769 0.0782 0.1055 0.0739 0.1047 0.0952 0.0917 0.1010 0.0858 0.0739 0.0939 0.1020 0.0801 0.0845 0.1020 0.1116 0.0899 0.0831 0.0939
va: 2.2988 2.2718 5.4258 2.0862 1.9810 3.8243 3.7919 3.8844 3.8570 3.9196 3.9459 3.9318 3.9552 3.8414 3.9672 1.0105 1.0405 1.0187 1.0077 1.0114 1.0071 1.0040 1.0113 1.0160 1.0182 1.0058 1.0053 1.0015 1.0165 1.0044 1.0071 1.0043 0.9969 0.9955 0.9926 1.0059 1.0068 1.0044
dispcorr: -0.018700021 hartree
energy: -1683.343237712930
dipole: -1.99037 2.39454 0.40416 -12.76528 11.59146 -1.17382 -8.02987 6.31439 -1.71547
magnitude: 2.11755 au
magnitude: 5.38239 debye
