program: Orca
programVersion: 5.0.4
elementType: S S P O O C C C C C C C C C C H H H H H H H H H H H H H H H H H H H H H H H
charge: 0
multiplicity: 1
keywords: wb97x-d3
keywords: def2-TZVPP
keywords: def2/J RIJCOSX
keywords: DEFGRID2
keywords: scfconv7
keywords: smallprint printgap noloewdin
keywords: NOSOSCF
formula: C10H23O2PS2
InChI: InChI=1/C10H23O2PS2/c1-6-9(4)14-13(11,12-8-3)15-10(5)7-2/h9-10H,6-8H2,1-5H3
38 atoms
S  1.44591 1.27713 -0.466976
S  -0.64665 -1.172034 -0.644941
P  -0.147393 0.441396 0.560984
O  -1.295414 1.544612 0.440601
O  0.078602 0.096258 1.986816
C  2.781591 0.043864 -0.088028
C  -1.837919 -2.090233 0.439581
C  3.915728 0.754181 0.640105
C  -2.990355 -2.588881 -0.424046
C  3.225387 -0.62029 -1.377493
C  -1.10862 -3.214123 1.150301
C  3.546363 1.285889 2.01383
C  -3.844415 -1.491209 -1.035766
C  -1.831623 2.044366 -0.797462
C  -1.503665 3.5084 -0.95154
H  2.348393 -0.707748 0.575499
H  -2.227689 -1.380594 1.172612
H  4.305046 1.560582 0.011947
H  4.728975 0.028905 0.740208
H  -2.607071 -3.252222 -1.205276
H  -3.614975 -3.214405 0.22075
H  2.401801 -1.146421 -1.859243
H  4.006293 -1.35169 -1.159948
H  3.631873 0.101878 -2.086656
H  -1.799901 -3.747335 1.806603
H  -0.292279 -2.834933 1.763739
H  -0.696456 -3.934096 0.441839
H  2.773414 2.052855 1.95872
H  4.415797 1.731236 2.498151
H  3.179692 0.489763 2.663457
H  -4.235017 -0.819473 -0.269053
H  -4.698089 -1.91771 -1.563665
H  -3.285521 -0.890294 -1.753486
H  -2.909804 1.890041 -0.752694
H  -1.455231 1.468915 -1.646616
H  -0.430936 3.679505 -1.045749
H  -1.981177 3.887524 -1.85553
H  -1.874715 4.091958 -0.108809
elementType: S P O C H
totalener: -1683.32742172 hartree
nucrepener: 1577.23645352 hartree
electener: -3260.56387524 hartree
oneelecener: -5452.36838801 hartree
twoeener: 2191.80451278 hartree
cpcmener: -0.02281337 hartree
kineticenergy: 1678.53522389 hartree
xcener: -109.971766368041 hartree
chargesum: 0.0000000
charge: -0.232287 -0.214349 0.734314 -0.352612 -0.620266 0.089320 0.092770 -0.100336 -0.101963 -0.263353 -0.276084 -0.272215 -0.276948 0.022557 -0.227944 0.069547 0.073431 0.075199 0.076659 0.075828 0.076569 0.094783 0.097743 0.095166 0.096608 0.095624 0.090806 0.075664 0.096620 0.081645 0.083773 0.101424 0.076238 0.108056 0.095907 0.076927 0.092913 0.092264
qa: -0.2323 -0.2143 0.7343 -0.3526 -0.6203 0.0893 0.0928 -0.1003 -0.1020 -0.2634 -0.2761 -0.2722 -0.2769 0.0226 -0.2279 0.0695 0.0734 0.0752 0.0767 0.0758 0.0766 0.0948 0.0977 0.0952 0.0966 0.0956 0.0908 0.0757 0.0966 0.0816 0.0838 0.1014 0.0762 0.1081 0.0959 0.0769 0.0929 0.0923
va: 2.2665 2.2741 5.4363 2.0862 1.9826 3.8168 3.8030 3.8875 3.8653 3.9490 3.9497 3.9391 3.9460 3.8330 3.9642 1.0366 1.0398 1.0116 1.0081 1.0115 1.0077 1.0121 1.0035 1.0040 1.0046 1.0193 1.0054 1.0165 1.0065 1.0052 0.9996 1.0058 1.0073 0.9926 1.0030 1.0088 1.0072 1.0034
dispcorr: -0.017922376 hartree
energy: -1683.345344094023
dipole: -0.62790 0.24961 -0.37829 -5.13646 4.62661 -0.50985 -2.86056 1.16844 -1.69213
magnitude: 1.80730 au
magnitude: 4.59380 debye
