program: Orca
programVersion: 5.0.4
elementType: S S P O O C C C C C C C C C C H H H H H H H H H H H H H H H H H H H H H H H
charge: 0
multiplicity: 1
keywords: wb97x-d3
keywords: def2-TZVPP
keywords: def2/J RIJCOSX
keywords: DEFGRID2
keywords: scfconv7
keywords: smallprint printgap noloewdin
keywords: NOSOSCF
formula: C10H23O2PS2
InChI: InChI=1/C10H23O2PS2/c1-6-9(4)14-13(11,12-8-3)15-10(5)7-2/h9-10H,6-8H2,1-5H3
38 atoms
S  1.269247 1.629838 -0.233499
S  -0.710802 -0.843624 -0.968048
P  -0.277598 0.499221 0.560796
O  -1.476718 1.54702 0.667726
O  -0.034467 -0.142602 1.875804
C  2.67085 0.423276 -0.09288
C  -1.780147 -2.061744 -0.063672
C  3.333189 0.556291 1.272977
C  -2.860965 -2.51652 -1.040826
C  3.604689 0.699826 -1.258091
C  -0.925691 -3.192478 0.474978
C  4.409871 -0.494544 1.509999
C  -3.87285 -3.456721 -0.398814
C  -2.066481 2.245065 -0.445275
C  -1.735372 3.715238 -0.386602
H  2.244935 -0.577392 -0.205827
H  -2.254574 -1.524612 0.760624
H  2.572503 0.465461 2.049255
H  3.759863 1.558534 1.370107
H  -3.38405 -1.63835 -1.426008
H  -2.396676 -3.008536 -1.901314
H  4.435938 -0.005893 -1.246625
H  4.024353 1.706207 -1.207494
H  3.095404 0.588694 -2.214862
H  -1.532399 -3.881068 1.06552
H  -0.134063 -2.820621 1.122961
H  -0.465161 -3.76052 -0.334972
H  5.258938 -0.382974 0.835074
H  4.013682 -1.504391 1.385429
H  4.794622 -0.418366 2.527723
H  -3.429454 -4.409336 -0.107493
H  -4.680497 -3.677094 -1.09767
H  -4.32182 -3.010362 0.490943
H  -3.142201 2.085876 -0.368456
H  -1.742942 1.807437 -1.392835
H  -0.668993 3.902383 -0.516178
H  -2.260677 4.228803 -1.192617
H  -2.054207 4.160512 0.555932
elementType: S P O C H
totalener: -1683.32665659 hartree
nucrepener: 1552.44436280 hartree
electener: -3235.77101940 hartree
oneelecener: -5402.72006351 hartree
twoeener: 2166.94904411 hartree
cpcmener: -0.02184507 hartree
kineticenergy: 1678.52061173 hartree
xcener: -109.968609467620 hartree
chargesum: -0.0000000
charge: -0.226345 -0.212954 0.728813 -0.352941 -0.618090 0.089242 0.086841 -0.101819 -0.099348 -0.277886 -0.290038 -0.284134 -0.285038 0.024225 -0.228792 0.073425 0.079211 0.075906 0.068418 0.080640 0.075294 0.100676 0.100119 0.102620 0.100835 0.096405 0.091764 0.085134 0.086653 0.096015 0.086241 0.095739 0.086517 0.109292 0.094489 0.077716 0.093259 0.091894
qa: -0.2263 -0.2130 0.7288 -0.3529 -0.6181 0.0892 0.0868 -0.1018 -0.0993 -0.2779 -0.2900 -0.2841 -0.2850 0.0242 -0.2288 0.0734 0.0792 0.0759 0.0684 0.0806 0.0753 0.1007 0.1001 0.1026 0.1008 0.0964 0.0918 0.0851 0.0867 0.0960 0.0862 0.0957 0.0865 0.1093 0.0945 0.0777 0.0933 0.0919
va: 2.2867 2.2698 5.4296 2.0908 1.9856 3.8204 3.8194 3.8851 3.8787 3.9295 3.9475 3.9571 3.9555 3.8387 3.9483 1.0374 1.0391 1.0325 1.0168 1.0137 1.0104 0.9984 1.0017 1.0111 1.0000 1.0234 1.0051 0.9997 0.9989 1.0036 0.9999 1.0038 0.9988 0.9951 1.0080 1.0079 1.0078 1.0036
dispcorr: -0.016788413 hartree
energy: -1683.343445007689
dipole: 2.12462 -2.47028 -0.34566 -10.23689 10.06099 -0.17590 -2.43188 0.73841 -1.69347
magnitude: 1.73732 au
magnitude: 4.41591 debye
