program: Orca
programVersion: 5.0.4
elementType: S S P O O C C C C C C C C C C H H H H H H H H H H H H H H H H H H H H H H H
charge: 0
multiplicity: 1
keywords: wb97x-d3
keywords: def2-TZVPP
keywords: def2/J RIJCOSX
keywords: DEFGRID2
keywords: scfconv7
keywords: smallprint printgap noloewdin
keywords: NOSOSCF
formula: C10H23O2PS2
InChI: InChI=1/C10H23O2PS2/c1-6-9(4)14-13(11,12-8-3)15-10(5)7-2/h9-10H,6-8H2,1-5H3
38 atoms
S  1.397819 1.393989 -0.895636
S  -0.732496 -1.073228 -1.09011
P  -0.313569 0.630951 0.012129
O  -1.416576 1.662905 -0.525718
O  -0.250633 0.458545 1.488284
C  2.807971 0.694323 0.07986
C  -1.928425 -2.02858 -0.048048
C  2.817446 -0.827366 0.15289
C  -1.228014 -2.789853 1.070762
C  2.933102 1.360347 1.437867
C  -3.101492 -1.19407 0.43273
C  2.979292 -1.523148 -1.186725
C  -0.213909 -3.814025 0.590467
C  -1.540139 2.983419 0.045759
C  -2.481831 3.001757 1.22524
H  3.649861 1.013615 -0.54212
H  -2.297538 -2.749129 -0.78476
H  1.923691 -1.187444 0.668735
H  3.657956 -1.099378 0.798767
H  -0.761397 -2.084636 1.759903
H  -2.009405 -3.301121 1.642078
H  3.875752 1.057934 1.898519
H  2.12673 1.072383 2.10918
H  2.93863 2.446573 1.354362
H  -3.853494 -1.856561 0.86582
H  -3.57289 -0.646426 -0.38244
H  -2.811462 -0.484272 1.20688
H  2.153869 -1.306601 -1.864293
H  3.020697 -2.605238 -1.056859
H  3.904793 -1.217006 -1.678589
H  0.585202 -3.354324 0.00647
H  -0.683852 -4.57576 -0.035293
H  0.251534 -4.323739 1.43486
H  -1.920609 3.607198 -0.762379
H  -0.556985 3.373704 0.322151
H  -3.456013 2.586404 0.965508
H  -2.082628 2.452042 2.07664
H  -2.635327 4.03506 1.539579
elementType: S P O C H
totalener: -1683.32430076 hartree
nucrepener: 1610.69655965 hartree
electener: -3294.02086041 hartree
oneelecener: -5519.75592740 hartree
twoeener: 2225.73506699 hartree
cpcmener: -0.01775410 hartree
kineticenergy: 1678.52844325 hartree
xcener: -109.972080448297 hartree
chargesum: 0.0000000
charge: -0.220329 -0.199503 0.742902 -0.364719 -0.614242 0.098098 0.104899 -0.118749 -0.142980 -0.291888 -0.297396 -0.289100 -0.255174 0.050390 -0.264038 0.088894 0.092937 0.056534 0.088096 0.082998 0.082012 0.098561 0.097621 0.096887 0.104465 0.105180 0.084363 0.078290 0.098958 0.097155 0.057965 0.088966 0.094823 0.106933 0.084994 0.088681 0.085624 0.100892
qa: -0.2203 -0.1995 0.7429 -0.3647 -0.6142 0.0981 0.1049 -0.1187 -0.1430 -0.2919 -0.2974 -0.2891 -0.2552 0.0504 -0.2640 0.0889 0.0929 0.0565 0.0881 0.0830 0.0820 0.0986 0.0976 0.0969 0.1045 0.1052 0.0844 0.0783 0.0990 0.0972 0.0580 0.0890 0.0948 0.1069 0.0850 0.0887 0.0856 0.1009
va: 2.2876 2.2828 5.3715 2.0729 1.9487 3.7855 3.7821 3.8768 3.8952 3.9461 3.9329 3.9365 3.9426 3.8690 3.9233 1.0095 1.0094 1.0195 1.0086 1.0230 1.0077 1.0030 1.0205 1.0091 1.0037 1.0112 1.0153 1.0125 1.0010 1.0061 1.0111 1.0034 1.0044 0.9906 1.0086 1.0027 1.0190 1.0091
dispcorr: -0.020007120 hartree
energy: -1683.344307878564
dipole: 1.67471 -1.64503 0.02968 -9.49388 9.41645 -0.07743 10.17193 -10.16420 0.00773
magnitude: 0.08328 au
magnitude: 0.21169 debye
