program: Orca
programVersion: 5.0.4
elementType: S S P O O C C C C C C C C C C H H H H H H H H H H H H H H H H H H H H H H H
charge: 0
multiplicity: 1
keywords: wb97x-d3
keywords: def2-TZVPP
keywords: def2/J RIJCOSX
keywords: DEFGRID2
keywords: scfconv7
keywords: smallprint printgap noloewdin
keywords: NOSOSCF
formula: C10H23O2PS2
InChI: InChI=1/C10H23O2PS2/c1-6-9(4)14-13(11,12-8-3)15-10(5)7-2/h9-10H,6-8H2,1-5H3
38 atoms
S  1.543433 1.192206 -0.330548
S  -0.696281 -1.189672 -0.655116
P  -0.131248 0.378346 0.594681
O  -1.220806 1.540801 0.445851
O  0.032536 -0.009988 2.017817
C  2.910732 0.172593 0.398985
C  -1.826944 -2.167336 0.436254
C  4.174302 1.019004 0.253374
C  -3.108351 -1.42347 0.792612
C  3.011439 -1.183899 -0.268089
C  -2.068448 -3.481144 -0.290971
C  5.392956 0.354785 0.879172
C  -3.996478 -1.045512 -0.380539
C  -1.61162 2.124875 -0.808776
C  -2.937634 2.815095 -0.621772
H  2.67725 0.058483 1.458909
H  -1.265346 -2.367966 1.349261
H  4.011174 1.988937 0.728385
H  4.367414 1.214673 -0.805656
H  -3.664232 -2.075883 1.473544
H  -2.865023 -0.533452 1.376292
H  3.792477 -1.778613 0.208059
H  3.255605 -1.088937 -1.327284
H  2.084338 -1.748364 -0.182716
H  -1.14046 -4.033674 -0.43817
H  -2.535467 -3.341418 -1.266183
H  -2.733517 -4.105304 0.308857
H  5.210846 0.087957 1.921858
H  6.244697 1.035389 0.858148
H  5.689452 -0.549964 0.348603
H  -3.475909 -0.410313 -1.098736
H  -4.870792 -0.495976 -0.030262
H  -4.362054 -1.922043 -0.916981
H  -1.685517 1.351894 -1.578251
H  -0.846195 2.839847 -1.121033
H  -3.717296 2.111788 -0.327838
H  -2.87774 3.60352 0.128837
H  -3.23697 3.273908 -1.56446
elementType: S P O C H
totalener: -1683.32642754 hartree
nucrepener: 1562.80120448 hartree
electener: -3246.12763201 hartree
oneelecener: -5423.40196494 hartree
twoeener: 2177.27433293 hartree
cpcmener: -0.02177224 hartree
kineticenergy: 1678.52000033 hartree
xcener: -109.970802776493 hartree
chargesum: -0.0000000
charge: -0.220760 -0.214627 0.735452 -0.343965 -0.621536 0.067277 0.074424 -0.093996 -0.120457 -0.288660 -0.298103 -0.291117 -0.299309 -0.010714 -0.241868 0.088728 0.097319 0.084009 0.078559 0.086697 0.075765 0.103964 0.093591 0.092481 0.109425 0.098891 0.100631 0.088486 0.096164 0.086534 0.077369 0.103717 0.099545 0.114816 0.119982 0.087010 0.093560 0.090714
qa: -0.2208 -0.2146 0.7355 -0.3440 -0.6215 0.0673 0.0744 -0.0940 -0.1205 -0.2887 -0.2981 -0.2911 -0.2993 -0.0107 -0.2419 0.0887 0.0973 0.0840 0.0786 0.0867 0.0758 0.1040 0.0936 0.0925 0.1094 0.0989 0.1006 0.0885 0.0962 0.0865 0.0774 0.1037 0.0995 0.1148 0.1200 0.0870 0.0936 0.0907
va: 2.2943 2.2771 5.4033 2.0788 1.9921 3.8732 3.8499 3.8427 3.8441 3.9339 3.9407 3.9593 3.9450 3.8483 3.9577 1.0385 1.0291 1.0160 1.0112 1.0103 1.0318 1.0018 1.0066 1.0263 1.0079 0.9983 1.0003 0.9986 1.0037 0.9992 0.9985 1.0006 1.0021 0.9900 0.9918 1.0038 1.0040 1.0053
dispcorr: -0.017876769 hartree
energy: -1683.344304304195
dipole: -1.85516 1.62882 -0.22634 -6.43458 6.06398 -0.37060 -3.25657 1.83332 -1.42326
magnitude: 1.48803 au
magnitude: 3.78228 debye
