program: Orca
programVersion: 5.0.4
elementType: S S P O O C C C C C C C C C C H H H H H H H H H H H H H H H H H H H H H H H
charge: 0
multiplicity: 1
keywords: wb97x-d3
keywords: def2-TZVPP
keywords: def2/J RIJCOSX
keywords: DEFGRID2
keywords: scfconv7
keywords: smallprint printgap noloewdin
keywords: NOSOSCF
formula: C10H23O2PS2
InChI: InChI=1/C10H23O2PS2/c1-6-9(4)14-13(11,12-8-3)15-10(5)7-2/h9-10H,6-8H2,1-5H3
38 atoms
S  1.293643 0.397774 -0.882693
S  -1.778868 -0.469956 -0.582483
P  -0.270019 0.467423 0.488805
O  -0.791983 1.972811 0.603777
O  0.022426 -0.079889 1.837283
C  2.805371 0.864794 0.075362
C  -1.19862 -2.232184 -0.53731
C  3.34478 -0.285301 0.915155
C  -2.244058 -3.085628 0.168958
C  2.623358 2.147311 0.865965
C  -0.920169 -2.696413 -1.953951
C  3.676354 -1.54097 0.127323
C  -2.448592 -2.751365 1.635941
C  -1.084135 2.828042 -0.517919
C  -2.568683 3.065876 -0.633826
H  3.505321 1.058046 -0.743456
H  -0.272259 -2.252762 0.041102
H  2.643157 -0.515192 1.718635
H  4.253914 0.085257 1.399027
H  -3.192869 -3.022433 -0.371896
H  -1.913249 -4.124868 0.077784
H  2.232902 2.954682 0.24719
H  3.592229 2.467084 1.253857
H  1.961947 2.01193 1.721492
H  -1.815682 -2.657656 -2.575917
H  -0.571772 -3.731127 -1.93672
H  -0.147875 -2.092603 -2.429363
H  4.161758 -2.278885 0.767105
H  4.356009 -1.326036 -0.700022
H  2.78358 -2.008163 -0.289484
H  -3.162561 -3.440756 2.087939
H  -2.835841 -1.741561 1.773686
H  -1.515335 -2.829624 2.195967
H  -0.681089 2.406772 -1.441935
H  -0.556037 3.763568 -0.332666
H  -3.116354 2.151628 -0.864447
H  -2.978317 3.493906 0.281193
H  -2.752343 3.772815 -1.443775
elementType: S P O C H
totalener: -1683.32594263 hartree
nucrepener: 1593.12519720 hartree
electener: -3276.45113982 hartree
oneelecener: -5484.30913720 hartree
twoeener: 2207.85799738 hartree
cpcmener: -0.02227610 hartree
kineticenergy: 1678.53292578 hartree
xcener: -109.973459615487 hartree
chargesum: -0.0000000
charge: -0.211563 -0.237452 0.738077 -0.355067 -0.614453 0.093137 0.094222 -0.121386 -0.102686 -0.297779 -0.267596 -0.266721 -0.272370 0.022200 -0.230467 0.096093 0.063801 0.076815 0.079748 0.075023 0.076872 0.101876 0.105414 0.089081 0.097249 0.097720 0.095505 0.094113 0.084440 0.073015 0.096964 0.076037 0.081194 0.096918 0.107522 0.079131 0.091930 0.093445
qa: -0.2116 -0.2375 0.7381 -0.3551 -0.6145 0.0931 0.0942 -0.1214 -0.1027 -0.2978 -0.2676 -0.2667 -0.2724 0.0222 -0.2305 0.0961 0.0638 0.0768 0.0797 0.0750 0.0769 0.1019 0.1054 0.0891 0.0972 0.0977 0.0955 0.0941 0.0844 0.0730 0.0970 0.0760 0.0812 0.0969 0.1075 0.0791 0.0919 0.0934
va: 2.2763 2.2753 5.4198 2.0852 1.9844 3.7934 3.8237 3.8765 3.8909 3.9348 3.9477 3.9451 3.9390 3.8373 3.9572 1.0097 1.0372 1.0267 1.0073 1.0118 1.0078 1.0086 1.0030 1.0203 1.0047 1.0032 1.0117 1.0050 1.0016 1.0105 1.0066 1.0165 1.0054 1.0065 0.9943 1.0089 1.0035 1.0073
dispcorr: -0.018552189 hartree
energy: -1683.344494815562
dipole: 4.61672 -4.00469 0.61204 -7.01370 7.29536 0.28167 -0.66872 -1.02728 -1.69600
magnitude: 1.82492 au
magnitude: 4.63858 debye
