program: Orca
programVersion: 5.0.4
elementType: S S P O O C C C C C C C C C C H H H H H H H H H H H H H H H H H H H H H H H
charge: 0
multiplicity: 1
keywords: wb97x-d3
keywords: def2-TZVPP
keywords: def2/J RIJCOSX
keywords: DEFGRID2
keywords: scfconv7
keywords: smallprint printgap noloewdin
keywords: NOSOSCF
formula: C10H23O2PS2
InChI: InChI=1/C10H23O2PS2/c1-6-9(4)14-13(11,12-8-3)15-10(5)7-2/h9-10H,6-8H2,1-5H3
38 atoms
S  1.503789 0.004576 -0.455545
S  -1.666982 -0.834085 -0.648993
P  -0.329537 0.283283 0.48483
O  -0.772894 1.795193 0.206829
O  -0.313598 0.00222 1.942796
C  2.657725 0.71181 0.813114
C  -1.609707 -2.463621 0.233381
C  3.729372 1.525691 0.098293
C  -2.929386 -3.174647 -0.048285
C  3.232419 -0.419639 1.642835
C  -0.41132 -3.28234 -0.202274
C  3.213351 2.786275 -0.573067
C  -4.158168 -2.485804 0.520606
C  -0.931917 2.345087 -1.113297
C  -0.846417 3.846779 -1.026378
H  2.07518 1.379935 1.450391
H  -1.546179 -2.237157 1.29843
H  4.25534 0.894805 -0.624459
H  4.470513 1.799406 0.855507
H  -3.043019 -3.334107 -1.124751
H  -2.83849 -4.170641 0.395324
H  2.448052 -0.981804 2.147678
H  3.900398 -0.017637 2.407344
H  3.806974 -1.113415 1.027647
H  -0.407507 -4.233207 0.334363
H  0.529611 -2.779038 0.015657
H  -0.441617 -3.49885 -1.270356
H  2.530259 2.562445 -1.39291
H  4.03781 3.36995 -0.983413
H  2.684093 3.421689 0.139406
H  -4.046883 -2.301413 1.590642
H  -5.042958 -3.10826 0.383589
H  -4.355981 -1.528019 0.039127
H  -1.902632 2.036363 -1.509363
H  -0.156189 1.957157 -1.779412
H  -1.619879 4.257827 -0.377754
H  0.127399 4.170913 -0.65914
H  -0.98713 4.269367 -2.021626
elementType: S P O C H
totalener: -1683.32736022 hartree
nucrepener: 1564.91112137 hartree
electener: -3248.23848160 hartree
oneelecener: -5427.68390034 hartree
twoeener: 2179.44541874 hartree
cpcmener: -0.02160584 hartree
kineticenergy: 1678.52806454 hartree
xcener: -109.969723813661 hartree
chargesum: 0.0000000
charge: -0.215408 -0.225559 0.736665 -0.348169 -0.621664 0.094743 0.078335 -0.097617 -0.102400 -0.279042 -0.270363 -0.279671 -0.265454 0.003236 -0.244709 0.070548 0.083923 0.075070 0.076044 0.077935 0.079133 0.095631 0.097977 0.090906 0.099657 0.087774 0.091156 0.077847 0.101311 0.082253 0.083077 0.093922 0.078091 0.115098 0.111735 0.093178 0.085257 0.089557
qa: -0.2154 -0.2256 0.7367 -0.3482 -0.6217 0.0947 0.0783 -0.0976 -0.1024 -0.2790 -0.2704 -0.2797 -0.2655 0.0032 -0.2447 0.0705 0.0839 0.0751 0.0760 0.0779 0.0791 0.0956 0.0980 0.0909 0.0997 0.0878 0.0912 0.0778 0.1013 0.0823 0.0831 0.0939 0.0781 0.1151 0.1117 0.0932 0.0853 0.0896
va: 2.2695 2.2793 5.4144 2.0932 1.9864 3.8066 3.8352 3.8607 3.8495 3.9422 3.9400 3.9561 3.9510 3.8337 3.9673 1.0405 1.0410 1.0121 1.0074 1.0118 1.0069 1.0194 1.0049 1.0055 1.0063 1.0223 1.0084 1.0028 1.0067 0.9988 1.0014 1.0045 1.0103 0.9932 0.9933 1.0040 1.0055 1.0051
dispcorr: -0.017479620 hartree
energy: -1683.344839844274
dipole: 4.86056 -4.29635 0.56421 0.22502 -0.19978 0.02524 -1.46082 0.11130 -1.34951
magnitude: 1.46293 au
magnitude: 3.71847 debye
