program: Orca
programVersion: 5.0.4
elementType: S S P O O C C C C C C C C C C H H H H H H H H H H H H H H H H H H H H H H H
charge: 0
multiplicity: 1
keywords: wb97x-d3
keywords: def2-TZVPP
keywords: def2/J RIJCOSX
keywords: DEFGRID2
keywords: scfconv7
keywords: smallprint printgap noloewdin
keywords: NOSOSCF
formula: C10H23O2PS2
InChI: InChI=1/C10H23O2PS2/c1-6-9(4)14-13(11,12-8-3)15-10(5)7-2/h9-10H,6-8H2,1-5H3
38 atoms
S  1.541151 0.216927 -1.060159
S  -1.585126 -0.649727 -0.995309
P  -0.191386 0.497917 0.037778
O  -0.630869 1.980927 -0.381204
O  -0.136811 0.221736 1.498606
C  2.923875 1.10728 -0.191266
C  -1.603727 -2.214729 -0.010883
C  3.806507 0.118352 0.562135
C  -2.936711 -2.889419 -0.330332
C  2.487299 2.307009 0.628186
C  -0.39161 -3.069178 -0.321461
C  3.174171 -0.568494 1.758734
C  -3.133147 -4.186864 0.441376
C  -1.740948 2.625486 0.28324
C  -1.277742 3.477157 1.438943
H  3.495025 1.478793 -1.045392
H  -1.598273 -1.920366 1.039683
H  4.690261 0.678077 0.885965
H  4.171652 -0.635094 -0.139929
H  -3.748166 -2.199947 -0.086661
H  -3.005166 -3.088542 -1.404009
H  1.866963 2.040582 1.481969
H  1.951248 3.034205 0.020875
H  3.379843 2.801132 1.016986
H  0.539212 -2.542489 -0.110931
H  -0.377649 -3.374654 -1.368816
H  -0.394336 -3.969661 0.294775
H  2.32767 -1.190711 1.466754
H  2.828332 0.142084 2.509866
H  3.903367 -1.22015 2.24151
H  -4.148647 -4.558734 0.301665
H  -2.980746 -4.042334 1.512591
H  -2.452876 -4.970792 0.109068
H  -2.475557 1.884832 0.610676
H  -2.217682 3.236375 -0.482734
H  -0.835135 2.879141 2.234658
H  -0.553859 4.227634 1.119912
H  -2.136532 4.003492 1.857968
elementType: S P O C H
totalener: -1683.32396348 hartree
nucrepener: 1573.52262598 hartree
electener: -3256.84658947 hartree
oneelecener: -5445.39338414 hartree
twoeener: 2188.54679467 hartree
cpcmener: -0.01956428 hartree
kineticenergy: 1678.52237016 hartree
xcener: -109.969615115797 hartree
chargesum: -0.0000000
charge: -0.196242 -0.205380 0.736155 -0.364481 -0.616142 0.086397 0.057573 -0.111436 -0.098376 -0.321034 -0.274169 -0.274065 -0.290054 0.044878 -0.261684 0.105211 0.086984 0.075998 0.078721 0.083677 0.077741 0.089112 0.110169 0.108786 0.076306 0.094570 0.103467 0.065804 0.088307 0.100103 0.096255 0.088189 0.086578 0.087740 0.107326 0.085888 0.088575 0.102555
qa: -0.1962 -0.2054 0.7362 -0.3645 -0.6161 0.0864 0.0576 -0.1114 -0.0984 -0.3210 -0.2742 -0.2741 -0.2901 0.0449 -0.2617 0.1052 0.0870 0.0760 0.0787 0.0837 0.0777 0.0891 0.1102 0.1088 0.0763 0.0946 0.1035 0.0658 0.0883 0.1001 0.0963 0.0882 0.0866 0.0877 0.1073 0.0859 0.0886 0.1026
va: 2.2932 2.3095 5.3987 2.0746 1.9518 3.8172 3.8567 3.8953 3.8487 3.9548 3.9420 3.9446 3.9554 3.8705 3.9255 1.0087 1.0409 1.0092 1.0114 1.0158 1.0108 1.0101 1.0123 1.0037 1.0213 1.0083 1.0019 1.0084 0.9993 1.0072 1.0039 0.9989 0.9989 1.0082 0.9924 1.0162 1.0014 1.0100
dispcorr: -0.018613543 hartree
energy: -1683.342577024070
dipole: 2.37913 -2.30103 0.07810 -6.48087 6.72402 0.24315 11.82737 -11.89728 -0.06990
magnitude: 0.26478 au
magnitude: 0.67301 debye
