program: Orca
programVersion: 5.0.4
elementType: S S P O O C C C C C C C C C C H H H H H H H H H H H H H H H H H H H H H H H
charge: 0
multiplicity: 1
keywords: wb97x-d3
keywords: def2-TZVPP
keywords: def2/J RIJCOSX
keywords: DEFGRID2
keywords: scfconv7
keywords: smallprint printgap noloewdin
keywords: NOSOSCF
formula: C10H23O2PS2
InChI: InChI=1/C10H23O2PS2/c1-6-9(4)14-13(11,12-8-3)15-10(5)7-2/h9-10H,6-8H2,1-5H3
38 atoms
S  1.578067 1.35916 -0.694724
S  -0.526942 -1.077515 -1.062935
P  -0.205806 0.625629 0.066089
O  -1.266983 1.675784 -0.514118
O  -0.254204 0.419655 1.538987
C  2.78682 0.226702 0.138323
C  -1.914745 -1.868627 -0.118164
C  3.223933 0.816207 1.474002
C  -2.804792 -2.560817 -1.147643
C  3.929108 0.002875 -0.837964
C  -1.361555 -2.801011 0.942076
C  4.123178 -0.12287 2.266684
C  -4.038369 -3.196787 -0.521876
C  -1.704772 2.799424 0.283553
C  -2.975788 2.469704 1.024676
H  2.271459 -0.723481 0.303256
H  -2.486559 -1.063835 0.35045
H  2.338517 1.045673 2.068398
H  3.737237 1.76546 1.297669
H  -3.118619 -1.826755 -1.892694
H  -2.228547 -3.322758 -1.681207
H  4.649179 -0.699934 -0.417024
H  4.461315 0.930685 -1.055952
H  3.574489 -0.418142 -1.778255
H  -0.820302 -3.635447 0.493187
H  -2.171541 -3.211707 1.547627
H  -0.684579 -2.280655 1.61728
H  3.643656 -1.090637 2.427441
H  4.341383 0.300163 3.248075
H  5.078832 -0.301815 1.773097
H  -3.788949 -4.039812 0.123232
H  -4.706073 -3.570803 -1.299135
H  -4.599653 -2.473373 0.073436
H  -1.865008 3.610389 -0.425915
H  -0.918499 3.118621 0.971615
H  -3.762664 2.150009 0.340764
H  -2.820173 1.688292 1.768439
H  -3.329735 3.360129 1.546231
elementType: S P O C H
totalener: -1683.32796814 hartree
nucrepener: 1548.44391757 hartree
electener: -3231.77188571 hartree
oneelecener: -5394.97214397 hartree
twoeener: 2163.20025825 hartree
cpcmener: -0.01946084 hartree
kineticenergy: 1678.51217061 hartree
xcener: -109.964149668933 hartree
chargesum: 0.0000000
charge: -0.203184 -0.192146 0.727108 -0.365414 -0.620426 0.073552 0.084498 -0.101301 -0.097180 -0.279053 -0.293728 -0.283174 -0.287360 0.049530 -0.255026 0.072092 0.074402 0.072408 0.067993 0.080772 0.076339 0.100482 0.099553 0.102559 0.093122 0.101481 0.096666 0.087116 0.095665 0.085029 0.085948 0.096480 0.086364 0.105456 0.092121 0.088588 0.083053 0.099618
qa: -0.2032 -0.1921 0.7271 -0.3654 -0.6204 0.0736 0.0845 -0.1013 -0.0972 -0.2791 -0.2937 -0.2832 -0.2874 0.0495 -0.2550 0.0721 0.0744 0.0724 0.0680 0.0808 0.0763 0.1005 0.0996 0.1026 0.0931 0.1015 0.0967 0.0871 0.0957 0.0850 0.0859 0.0965 0.0864 0.1055 0.0921 0.0886 0.0831 0.0996
va: 2.2922 2.2888 5.4023 2.0751 1.9479 3.8212 3.8520 3.8875 3.8710 3.9303 3.9515 3.9554 3.9577 3.8571 3.9259 1.0371 1.0309 1.0331 1.0163 1.0158 1.0111 0.9984 1.0018 1.0113 1.0049 0.9997 1.0240 0.9988 1.0039 0.9999 0.9997 1.0039 0.9985 0.9934 1.0051 1.0030 1.0173 1.0092
dispcorr: -0.016901142 hartree
energy: -1683.344869286294
dipole: -2.18089 1.88876 -0.29213 -10.58705 10.35992 -0.22713 9.50532 -9.62736 -0.12204
magnitude: 0.38964 au
magnitude: 0.99040 debye
