program: Orca
programVersion: 5.0.4
elementType: S S P O O C C C C C C C C C C H H H H H H H H H H H H H H H H H H H H H H H
charge: 0
multiplicity: 1
keywords: wb97x-d3
keywords: def2-TZVPP
keywords: def2/J RIJCOSX
keywords: DEFGRID2
keywords: scfconv7
keywords: smallprint printgap noloewdin
keywords: NOSOSCF
formula: C10H23O2PS2
InChI: InChI=1/C10H23O2PS2/c1-6-9(4)14-13(11,12-8-3)15-10(5)7-2/h9-10H,6-8H2,1-5H3
38 atoms
S  1.303141 1.250847 -1.202144
S  -0.584298 -1.363993 -1.019672
P  -0.206063 0.420402 -0.031408
O  -1.457506 1.335974 -0.434101
O  0.084181 0.341856 1.424852
C  2.890604 0.764587 -0.387567
C  -2.200205 -2.007218 -0.375112
C  3.020418 -0.746593 -0.235418
C  -2.347309 -1.970298 1.138988
C  3.135395 1.553522 0.885403
C  -3.367961 -1.359021 -1.096305
C  4.42856 -1.175426 0.153301
C  -1.302547 -2.762967 1.903397
C  -1.650329 2.619178 0.201095
C  -2.536813 2.509188 1.417141
H  3.604362 1.094939 -1.148391
H  -2.131111 -3.052872 -0.689919
H  2.748884 -1.224238 -1.178881
H  2.312773 -1.105984 0.515266
H  -2.380511 -0.934885 1.486894
H  -3.336877 -2.383011 1.357164
H  4.161432 1.403776 1.225361
H  2.468651 1.244296 1.688427
H  3.001966 2.622288 0.721437
H  -4.288247 -1.888689 -0.840925
H  -3.249739 -1.404541 -2.178382
H  -3.495692 -0.315976 -0.8112
H  5.169907 -0.798997 -0.554511
H  4.503382 -2.263234 0.158545
H  4.708474 -0.82737 1.147704
H  -1.313616 -3.813885 1.608673
H  -1.498638 -2.720683 2.975183
H  -0.294435 -2.384367 1.739542
H  -2.11016 3.248495 -0.559822
H  -0.687518 3.069946 0.455395
H  -3.491538 2.043395 1.173213
H  -2.064115 1.939233 2.215507
H  -2.743935 3.509094 1.799924
elementType: S P O C H
totalener: -1683.32341127 hartree
nucrepener: 1593.14333809 hartree
electener: -3276.46674936 hartree
oneelecener: -5484.68133017 hartree
twoeener: 2208.21458081 hartree
cpcmener: -0.01910212 hartree
kineticenergy: 1678.52818946 hartree
xcener: -109.970320421852 hartree
chargesum: -0.0000000
charge: -0.212229 -0.196639 0.727236 -0.362577 -0.614925 0.108554 0.072249 -0.116887 -0.105959 -0.304519 -0.271893 -0.286555 -0.264744 0.048312 -0.265544 0.091938 0.092708 0.082280 0.056890 0.056555 0.087544 0.102855 0.098377 0.096745 0.098608 0.097167 0.087107 0.087058 0.095762 0.085977 0.086154 0.096502 0.067162 0.108071 0.091138 0.089840 0.085364 0.104319
qa: -0.2122 -0.1966 0.7272 -0.3626 -0.6149 0.1086 0.0722 -0.1169 -0.1060 -0.3045 -0.2719 -0.2866 -0.2647 0.0483 -0.2655 0.0919 0.0927 0.0823 0.0569 0.0566 0.0875 0.1029 0.0984 0.0967 0.0986 0.0972 0.0871 0.0871 0.0958 0.0860 0.0862 0.0965 0.0672 0.1081 0.0911 0.0898 0.0854 0.1043
va: 2.2985 2.2759 5.3859 2.0760 1.9487 3.7825 3.8184 3.8978 3.8681 3.9525 3.9474 3.9734 3.9621 3.8536 3.9363 1.0114 1.0085 1.0124 1.0198 1.0249 1.0059 0.9990 1.0178 1.0104 1.0035 1.0113 1.0154 0.9994 1.0031 0.9993 1.0025 1.0036 1.0131 0.9930 1.0071 1.0007 1.0170 1.0093
dispcorr: -0.019195275 hartree
energy: -1683.342606543634
dipole: 0.13457 -0.55717 -0.42260 -5.01009 5.14404 0.13395 11.70207 -11.95945 -0.25738
magnitude: 0.51262 au
magnitude: 1.30298 debye
