program: Orca
programVersion: 5.0.4
elementType: S S P O O C C C C C C C C C C H H H H H H H H H H H H H H H H H H H H H H H
charge: 0
multiplicity: 1
keywords: wb97x-d3
keywords: def2-TZVPP
keywords: def2/J RIJCOSX
keywords: DEFGRID2
keywords: scfconv7
keywords: smallprint printgap noloewdin
keywords: NOSOSCF
formula: C10H23O2PS2
InChI: InChI=1/C10H23O2PS2/c1-6-9(4)14-13(11,12-8-3)15-10(5)7-2/h9-10H,6-8H2,1-5H3
38 atoms
S  1.469176 1.386616 -0.619969
S  -0.568716 -1.105983 -1.130674
P  -0.212952 0.468728 0.170929
O  -1.361082 1.52515 -0.187918
O  -0.130038 0.064567 1.599735
C  2.776441 0.174398 -0.118799
C  -1.533131 -2.267385 -0.06088
C  3.301525 0.501886 1.273207
C  -2.944715 -1.747847 0.181898
C  3.841302 0.213699 -1.201197
C  -1.492182 -3.613163 -0.767188
C  4.275546 -0.546292 1.793441
C  -3.762805 -2.658224 1.087386
C  -1.576557 2.708454 0.613634
C  -3.03667 3.072655 0.540243
H  2.30689 -0.81305 -0.117789
H  -0.992866 -2.340321 0.884353
H  2.46143 0.577876 1.964219
H  3.781277 1.484403 1.255561
H  -2.89312 -0.758629 0.640665
H  -3.452447 -1.617655 -0.777491
H  4.319234 1.193328 -1.260155
H  3.425068 -0.023147 -2.179947
H  4.618886 -0.521202 -0.990505
H  -1.968446 -4.372738 -0.146831
H  -0.46884 -3.941496 -0.949088
H  -2.019087 -3.585949 -1.722636
H  5.192806 -0.591876 1.205736
H  3.827042 -1.541825 1.790101
H  4.561658 -0.321086 2.821457
H  -3.9810 -3.619595 0.621975
H  -4.718796 -2.191691 1.328187
H  -3.246746 -2.851989 2.029887
H  -0.953198 3.512388 0.217666
H  -1.276696 2.526518 1.647397
H  -3.66623 2.289173 0.962655
H  -3.207345 3.98427 1.113839
H  -3.35359 3.260659 -0.48594
elementType: S P O C H
totalener: -1683.32866951 hartree
nucrepener: 1549.04673039 hartree
electener: -3232.37539990 hartree
oneelecener: -5396.19694366 hartree
twoeener: 2163.82154376 hartree
cpcmener: -0.01940107 hartree
kineticenergy: 1678.52449632 hartree
xcener: -109.966888300895 hartree
chargesum: -0.0000000
charge: -0.209204 -0.189092 0.732697 -0.357480 -0.622219 0.075433 0.064955 -0.104548 -0.090455 -0.277579 -0.289509 -0.283490 -0.288473 0.031149 -0.243932 0.074205 0.087899 0.074491 0.068098 0.061029 0.068831 0.099209 0.102866 0.100301 0.101503 0.104372 0.101258 0.085016 0.086306 0.095196 0.088298 0.095848 0.087937 0.102769 0.098670 0.088236 0.090250 0.089161
qa: -0.2092 -0.1891 0.7327 -0.3575 -0.6222 0.0754 0.0650 -0.1045 -0.0905 -0.2776 -0.2895 -0.2835 -0.2885 0.0311 -0.2439 0.0742 0.0879 0.0745 0.0681 0.0610 0.0688 0.0992 0.1029 0.1003 0.1015 0.1044 0.1013 0.0850 0.0863 0.0952 0.0883 0.0958 0.0879 0.1028 0.0987 0.0882 0.0902 0.0892
va: 2.2916 2.2996 5.4033 2.0833 1.9664 3.8170 3.8333 3.8865 3.8757 3.9263 3.9318 3.9558 3.9631 3.8613 3.9575 1.0381 1.0391 1.0342 1.0164 1.0294 1.0185 1.0023 1.0115 0.9986 0.9970 1.0103 1.0014 1.0000 0.9990 1.0037 0.9979 1.0036 0.9989 0.9921 1.0002 1.0044 1.0072 1.0032
dispcorr: -0.016640997 hartree
energy: -1683.345310505622
dipole: -1.06562 1.03760 -0.02802 -9.16284 8.98546 -0.17738 7.49556 -7.68564 -0.19007
magnitude: 0.26149 au
magnitude: 0.66465 debye
