program: Orca
programVersion: 5.0.4
elementType: S S P O O C C C C C C C C C C H H H H H H H H H H H H H H H H H H H H H H H
charge: 0
multiplicity: 1
keywords: wb97x-d3
keywords: def2-TZVPP
keywords: def2/J RIJCOSX
keywords: DEFGRID2
keywords: scfconv7
keywords: smallprint printgap noloewdin
keywords: NOSOSCF
formula: C10H23O2PS2
InChI: InChI=1/C10H23O2PS2/c1-6-9(4)14-13(11,12-8-3)15-10(5)7-2/h9-10H,6-8H2,1-5H3
38 atoms
S  1.624723 -0.041108 -0.388444
S  -1.515292 -0.761352 -1.030707
P  -0.310808 0.507802 0.085283
O  -0.460778 1.89625 -0.700789
O  -0.63237 0.55002 1.537366
C  2.560989 1.041943 0.797763
C  -1.918625 -2.07997 0.204368
C  3.80253 1.57108 0.086492
C  -3.175703 -2.774149 -0.317698
C  2.852402 0.278631 2.074694
C  -0.742791 -3.014168 0.404711
C  4.793475 0.514172 -0.374883
C  -3.696046 -3.834854 0.642577
C  -1.608471 2.740909 -0.458707
C  -1.296073 3.797823 0.570893
H  1.919579 1.895849 1.023413
H  -2.158289 -1.567526 1.137238
H  4.297812 2.251513 0.785764
H  3.489839 2.181133 -0.763761
H  -3.954567 -2.024937 -0.477217
H  -2.972063 -3.22929 -1.29149
H  3.433261 -0.624932 1.890578
H  1.931768 -0.012758 2.578037
H  3.421412 0.910618 2.760532
H  0.144591 -2.482408 0.747403
H  -0.489481 -3.535359 -0.519613
H  -0.978334 -3.762451 1.163063
H  4.355203 -0.173228 -1.101652
H  5.179996 -0.079793 0.453871
H  5.648165 0.985891 -0.860643
H  -3.849938 -3.425845 1.642918
H  -3.018971 -4.684792 0.728231
H  -4.654898 -4.22043 0.29449
H  -2.472905 2.142869 -0.158333
H  -1.8464 3.190867 -1.422073
H  -1.09103 3.362454 1.548631
H  -0.440224 4.403904 0.272591
H  -2.154615 4.462683 0.6747
elementType: S P O C H
totalener: -1683.32722995 hartree
nucrepener: 1548.42681136 hartree
electener: -3231.75404131 hartree
oneelecener: -5395.01199865 hartree
twoeener: 2163.25795735 hartree
cpcmener: -0.01926195 hartree
kineticenergy: 1678.53066745 hartree
xcener: -109.968822360841 hartree
chargesum: -0.0000000
charge: -0.199427 -0.201636 0.736684 -0.362700 -0.623493 0.090240 0.056305 -0.113489 -0.095487 -0.296358 -0.278628 -0.267309 -0.288633 0.046459 -0.254063 0.077391 0.086333 0.076168 0.084090 0.082161 0.078737 0.093006 0.097730 0.101322 0.084554 0.093035 0.102694 0.076405 0.087049 0.096326 0.087554 0.086577 0.095713 0.087817 0.107070 0.083531 0.088381 0.097894
qa: -0.1994 -0.2016 0.7367 -0.3627 -0.6235 0.0902 0.0563 -0.1135 -0.0955 -0.2964 -0.2786 -0.2673 -0.2886 0.0465 -0.2541 0.0774 0.0863 0.0762 0.0841 0.0822 0.0787 0.0930 0.0977 0.1013 0.0846 0.0930 0.1027 0.0764 0.0870 0.0963 0.0876 0.0866 0.0957 0.0878 0.1071 0.0835 0.0884 0.0979
va: 2.2891 2.3056 5.3934 2.0719 1.9536 3.8613 3.8619 3.9056 3.8490 3.9566 3.9375 3.9322 3.9554 3.8672 3.9345 1.0292 1.0422 1.0079 1.0149 1.0159 1.0107 1.0010 1.0233 1.0029 1.0258 1.0070 1.0025 1.0084 0.9984 1.0038 0.9991 0.9995 1.0038 1.0072 0.9920 1.0185 1.0032 1.0087
dispcorr: -0.016864669 hartree
energy: -1683.344094616625
dipole: 3.84045 -3.84107 -0.00062 -4.48245 4.71590 0.23346 8.46249 -8.55407 -0.09158
magnitude: 0.25078 au
magnitude: 0.63742 debye
