program: Orca
programVersion: 5.0.4
elementType: S S P O O C C C C C C C C C C H H H H H H H H H H H H H H H H H H H H H H H
charge: 0
multiplicity: 1
keywords: wb97x-d3
keywords: def2-TZVPP
keywords: def2/J RIJCOSX
keywords: DEFGRID2
keywords: scfconv7
keywords: smallprint printgap noloewdin
keywords: NOSOSCF
formula: C10H23O2PS2
InChI: InChI=1/C10H23O2PS2/c1-6-9(4)14-13(11,12-8-3)15-10(5)7-2/h9-10H,6-8H2,1-5H3
38 atoms
S  1.520776 1.442096 -0.930348
S  -0.538723 -1.066315 -1.234924
P  -0.174055 0.608606 -0.065671
O  -1.285874 1.666811 -0.534751
O  -0.103527 0.323027 1.386529
C  2.795427 0.255344 -0.322176
C  -1.364643 -2.169808 -0.008259
C  3.285835 0.657561 1.063004
C  -2.803442 -1.73197 0.239726
C  3.888489 0.213955 -1.378392
C  -1.245847 -3.582491 -0.562034
C  4.253196 -0.35367 1.665333
C  -3.509463 -2.580534 1.290441
C  -1.457563 2.881657 0.213332
C  -2.487272 2.71522 1.307609
H  2.312507 -0.725277 -0.274687
H  -0.790977 -2.088358 0.916453
H  2.423753 0.763753 1.721484
H  3.758762 1.641777 1.002864
H  -2.806311 -0.691379 0.568985
H  -3.355151 -1.758514 -0.703568
H  4.370848 1.186429 -1.489927
H  3.489814 -0.080564 -2.347991
H  4.65699 -0.507949 -1.101671
H  -1.809767 -3.697859 -1.489226
H  -1.636386 -4.303449 0.156591
H  -0.20787 -3.847502 -0.759982
H  5.18924 -0.419881 1.110072
H  3.812299 -1.351757 1.697689
H  4.504388 -0.076678 2.689111
H  -3.657595 -3.609387 0.962337
H  -4.493712 -2.170215 1.515166
H  -2.945093 -2.604893 2.224073
H  -1.776605 3.627393 -0.515262
H  -0.502394 3.21958 0.62724
H  -2.152608 2.000336 2.057649
H  -2.655131 3.672815 1.80229
H  -3.440435 2.3771 0.900707
totalener: -1683.30885332 hartree
nucrepener: 1562.35095701 hartree
electener: -3245.65981033 hartree
oneelecener: -5422.10285540 hartree
twoeener: 2176.44304507 hartree
kineticenergy: 1678.56963517 hartree
xcener: -109.972305316431 hartree
chargesum: -0.0000000
charge: -0.189236 -0.166340 0.681924 -0.334259 -0.534484 0.050854 0.039124 -0.098644 -0.081335 -0.271584 -0.280045 -0.270832 -0.274577 0.038852 -0.261474 0.061738 0.088653 0.091754 0.059577 0.065118 0.065102 0.091909 0.105719 0.088146 0.095154 0.090173 0.100605 0.074857 0.081387 0.090207 0.078063 0.088935 0.087352 0.094700 0.080753 0.100239 0.088338 0.083576
qa: -0.1892 -0.1663 0.6819 -0.3343 -0.5345 0.0509 0.0391 -0.0986 -0.0813 -0.2716 -0.2800 -0.2708 -0.2746 0.0389 -0.2615 0.0617 0.0887 0.0918 0.0596 0.0651 0.0651 0.0919 0.1057 0.0881 0.0952 0.0902 0.1006 0.0749 0.0814 0.0902 0.0781 0.0889 0.0874 0.0947 0.0808 0.1002 0.0883 0.0836
va: 2.3011 2.3049 5.4303 2.0941 2.0526 3.8664 3.8683 3.8673 3.8844 3.9257 3.9273 3.9563 3.9560 3.8961 3.9161 1.0433 1.0411 1.0348 1.0182 1.0217 1.0208 1.0050 1.0130 1.0017 1.0033 1.0003 1.0131 1.0015 1.0008 1.0067 1.0009 1.0064 1.0003 0.9912 1.0078 1.0188 1.0126 1.0028
dispcorr: -0.017150808 hartree
energy: -1683.326004132707
dipole: 0.53910 -0.56164 -0.02255 -10.06088 9.89983 -0.16105 11.03783 -10.97547 0.06236
magnitude: 0.17417 au
magnitude: 0.44271 debye
