program: Orca
programVersion: 5.0.4
elementType: S S P O O C C C C C C C C C C H H H H H H H H H H H H H H H H H H H H H H H
charge: 0
multiplicity: 1
keywords: wb97x-d3
keywords: def2-TZVPP
keywords: def2/J RIJCOSX
keywords: DEFGRID2
keywords: scfconv7
keywords: smallprint printgap noloewdin
keywords: NOSOSCF
formula: C10H23O2PS2
InChI: InChI=1/C10H23O2PS2/c1-6-9(4)14-13(11,12-8-3)15-10(5)7-2/h9-10H,6-8H2,1-5H3
38 atoms
S  1.574223 0.720013 -0.630299
S  -0.73097 -1.601348 -0.517609
P  -0.183708 0.197667 0.357387
O  -1.230665 1.237405 -0.283407
O  -0.103517 0.18361 1.835159
C  2.833034 0.134594 0.586168
C  -1.937904 -2.230885 0.729172
C  4.140023 0.861121 0.279866
C  -3.230855 -1.422469 0.768681
C  2.989621 -1.373609 0.526451
C  -2.150503 -3.701955 0.400678
C  4.088253 2.371011 0.45656
C  -3.985183 -1.32864 -0.547614
C  -1.223333 2.599962 0.165591
C  -2.201548 3.376853 -0.680978
H  2.472149 0.435113 1.571364
H  -1.4421 -2.149017 1.697431
H  4.472315 0.607897 -0.731329
H  4.894314 0.444613 0.954469
H  -3.869355 -1.885057 1.528747
H  -3.01225 -0.419974 1.140573
H  3.742452 -1.697046 1.248466
H  3.30749 -1.697312 -0.464765
H  2.05938 -1.886442 0.764716
H  -1.219773 -4.263164 0.473892
H  -2.55119 -3.849179 -0.60216
H  -2.859304 -4.134911 1.108597
H  5.077306 2.808185 0.320473
H  3.741879 2.638172 1.455987
H  3.417758 2.84281 -0.260701
H  -3.387162 -0.832246 -1.311014
H  -4.901348 -0.752772 -0.418818
H  -4.271686 -2.309182 -0.928912
H  -0.215472 3.015604 0.070082
H  -1.50046 2.638618 1.221443
H  -2.223022 4.41685 -0.355019
H  -1.917855 3.358844 -1.732979
H  -3.210668 2.975101 -0.589459
totalener: -1683.30898822 hartree
nucrepener: 1565.95444630 hartree
electener: -3249.26343452 hartree
oneelecener: -5429.35048559 hartree
twoeener: 2180.08705106 hartree
kineticenergy: 1678.57295458 hartree
xcener: -109.972924028515 hartree
chargesum: 0.0000000
charge: -0.200658 -0.170829 0.695323 -0.336513 -0.528816 0.046391 0.031126 -0.112435 -0.118313 -0.254842 -0.284809 -0.244924 -0.255181 0.017815 -0.230496 0.085708 0.102436 0.072857 0.068190 0.071718 0.074616 0.082523 0.084816 0.094117 0.105850 0.091965 0.087929 0.086943 0.076634 0.078484 0.089169 0.084767 0.074639 0.084409 0.103403 0.076282 0.085563 0.084143
qa: -0.2007 -0.1708 0.6953 -0.3365 -0.5288 0.0464 0.0311 -0.1124 -0.1183 -0.2548 -0.2848 -0.2449 -0.2552 0.0178 -0.2305 0.0857 0.1024 0.0729 0.0682 0.0717 0.0746 0.0825 0.0848 0.0941 0.1058 0.0920 0.0879 0.0869 0.0766 0.0785 0.0892 0.0848 0.0746 0.0844 0.1034 0.0763 0.0856 0.0841
va: 2.2929 2.2940 5.4186 2.0919 2.0810 3.8645 3.9050 3.8647 3.8648 3.9380 3.9354 3.9538 3.9353 3.8734 3.9566 1.0413 1.0275 1.0127 1.0073 1.0104 1.0303 1.0085 1.0105 1.0254 1.0105 1.0019 1.0028 1.0059 1.0040 1.0122 1.0140 1.0063 1.0035 1.0032 0.9997 1.0091 1.0053 1.0046
dispcorr: -0.017259708 hartree
energy: -1683.326247931686
dipole: -2.18248 2.14776 -0.03472 0.74221 -0.58463 0.15758 2.64847 -2.67421 -0.02574
magnitude: 0.16340 au
magnitude: 0.41532 debye
