program: Orca
programVersion: 5.0.4
elementType: S S P O O C C C C C C C C C C H H H H H H H H H H H H H H H H H H H H H H H
charge: 0
multiplicity: 1
keywords: wb97x-d3
keywords: def2-TZVPP
keywords: def2/J RIJCOSX
keywords: DEFGRID2
keywords: scfconv7
keywords: smallprint printgap noloewdin
keywords: NOSOSCF
formula: C10H23O2PS2
InChI: InChI=1/C10H23O2PS2/c1-6-9(4)14-13(11,12-8-3)15-10(5)7-2/h9-10H,6-8H2,1-5H3
38 atoms
S  1.586402 -0.140842 -0.661698
S  -1.640186 -0.506193 -1.007191
P  -0.218793 0.54428 0.093133
O  -0.312916 2.025257 -0.524585
O  -0.371632 0.465701 1.564214
C  2.750151 0.662289 0.531623
C  -1.950651 -1.933509 0.124349
C  4.012024 1.018225 -0.250855
C  -3.355315 -2.438857 -0.200631
C  2.989646 -0.254577 1.717187
C  -0.872701 -2.990312 -0.0295
C  5.05028 1.743891 0.595725
C  -3.812004 -3.552472 0.733629
C  -1.086903 3.03954 0.132444
C  -2.578121 2.853988 -0.040989
H  2.279765 1.588591 0.870847
H  -1.940183 -1.529415 1.138373
H  3.731787 1.645606 -1.099351
H  4.451376 0.108462 -0.671007
H  -4.055361 -1.603267 -0.132926
H  -3.388631 -2.789237 -1.236499
H  2.05236 -0.49565 2.213789
H  3.63951 0.224489 2.451384
H  3.464178 -1.184872 1.401679
H  -0.862223 -3.394665 -1.042333
H  -1.04103 -3.814149 0.665568
H  0.116366 -2.585748 0.180012
H  4.624136 2.625358 1.078232
H  5.881426 2.079714 -0.024011
H  5.464825 1.106091 1.375856
H  -4.851051 -3.814078 0.535006
H  -3.744058 -3.24651 1.778756
H  -3.221538 -4.460254 0.613421
H  -0.761519 3.974092 -0.324131
H  -0.825562 3.07532 1.191984
H  -2.850236 2.768872 -1.092441
H  -2.939235 1.967351 0.478119
H  -3.098068 3.718181 0.374058
totalener: -1683.30680527 hartree
nucrepener: 1548.50190943 hartree
electener: -3231.80871470 hartree
oneelecener: -5394.43974500 hartree
twoeener: 2162.63103030 hartree
kineticenergy: 1678.56708226 hartree
xcener: -109.971991714879 hartree
chargesum: 0.0000000
charge: -0.167386 -0.181904 0.689377 -0.341612 -0.533245 0.058348 0.036589 -0.106761 -0.106321 -0.284629 -0.262926 -0.268748 -0.269614 0.029143 -0.253416 0.064337 0.089689 0.086407 0.069319 0.082095 0.072753 0.114146 0.086419 0.084187 0.086628 0.087896 0.087790 0.079376 0.090972 0.079652 0.089855 0.083266 0.078683 0.092714 0.092644 0.090442 0.088927 0.084910
qa: -0.1674 -0.1819 0.6894 -0.3416 -0.5332 0.0583 0.0366 -0.1068 -0.1063 -0.2846 -0.2629 -0.2687 -0.2696 0.0291 -0.2534 0.0643 0.0897 0.0864 0.0693 0.0821 0.0728 0.1141 0.0864 0.0842 0.0866 0.0879 0.0878 0.0794 0.0910 0.0797 0.0899 0.0833 0.0787 0.0927 0.0926 0.0904 0.0889 0.0849
va: 2.3011 2.2971 5.4156 2.0968 2.0562 3.8879 3.8769 3.8705 3.8585 3.9403 3.9320 3.9542 3.9523 3.9015 3.9166 1.0352 1.0437 1.0161 1.0133 1.0166 1.0120 1.0254 1.0039 1.0068 1.0092 1.0053 1.0351 1.0010 1.0066 1.0020 1.0063 1.0013 1.0028 0.9882 1.0061 1.0041 1.0139 1.0135
dispcorr: -0.016938812 hartree
energy: -1683.323744081531
dipole: 2.45288 -2.43885 0.01403 -4.95475 5.13812 0.18337 8.77249 -8.71718 0.05531
magnitude: 0.19204 au
magnitude: 0.48814 debye
