program: Orca
programVersion: 5.0.4
elementType: S S P O O C C C C C C C C C C H H H H H H H H H H H H H H H H H H H H H H H
charge: 0
multiplicity: 1
keywords: wb97x-d3
keywords: def2-TZVPP
keywords: def2/J RIJCOSX
keywords: DEFGRID2
keywords: scfconv7
keywords: smallprint printgap noloewdin
keywords: NOSOSCF
formula: C10H23O2PS2
InChI: InChI=1/C10H23O2PS2/c1-6-9(4)14-13(11,12-8-3)15-10(5)7-2/h9-10H,6-8H2,1-5H3
38 atoms
S  1.446225 1.294639 -0.614138
S  -0.607571 -1.19488 -0.54322
P  -0.103716 0.522679 0.538328
O  -1.261997 1.60628 0.323774
O  0.159421 0.259595 1.964792
C  2.742366 0.00726 -0.318421
C  -1.500292 -2.15941 0.751809
C  3.921533 0.628386 0.420591
C  -2.8307 -1.526469 1.14752
C  3.13152 -0.60381 -1.65257
C  -1.635667 -3.577342 0.2165
C  3.596793 1.117713 1.822143
C  -3.844067 -1.371516 0.024302
C  -1.792873 1.979951 -0.949665
C  -1.398483 3.397629 -1.29338
H  2.290794 -0.761684 0.312392
H  -0.844249 -2.164542 1.622946
H  4.337371 1.44257 -0.180131
H  4.703514 -0.136256 0.472787
H  -3.256071 -2.152535 1.938589
H  -2.639824 -0.558476 1.613496
H  3.538327 0.145527 -2.332189
H  2.27525 -1.072501 -2.134466
H  3.89665 -1.36773 -1.502345
H  -2.152683 -4.196235 0.951487
H  -0.66111 -4.026041 0.029406
H  -2.206157 -3.617339 -0.711107
H  4.492286 1.49964 2.311364
H  3.191141 0.316752 2.439783
H  2.856835 1.916452 1.806158
H  -4.741773 -0.873126 0.389139
H  -4.153501 -2.332516 -0.387399
H  -3.444181 -0.774868 -0.795758
H  -2.877296 1.887946 -0.871747
H  -1.466981 1.285352 -1.729191
H  -1.874763 3.693102 -2.228484
H  -1.716694 4.094297 -0.518979
H  -0.321123 3.496229 -1.422404
totalener: -1683.30604626 hartree
nucrepener: 1590.09653936 hartree
electener: -3273.40258562 hartree
oneelecener: -5477.42540111 hartree
twoeener: 2204.02281550 hartree
kineticenergy: 1678.57915049 hartree
xcener: -109.978171904205 hartree
chargesum: 0.0000000
charge: -0.229543 -0.222368 0.710419 -0.322787 -0.509168 0.058339 0.060676 -0.111824 -0.132442 -0.247358 -0.287029 -0.238558 -0.265031 -0.004360 -0.216080 0.065995 0.102996 0.066210 0.065264 0.073934 0.091853 0.087759 0.098358 0.083408 0.089830 0.104972 0.091096 0.085274 0.084753 0.080692 0.094208 0.081115 0.072003 0.093848 0.092014 0.079754 0.090872 0.080904
qa: -0.2295 -0.2224 0.7104 -0.3228 -0.5092 0.0583 0.0607 -0.1118 -0.1324 -0.2474 -0.2870 -0.2386 -0.2650 -0.0044 -0.2161 0.0660 0.1030 0.0662 0.0653 0.0739 0.0919 0.0878 0.0984 0.0834 0.0898 0.1050 0.0911 0.0853 0.0848 0.0807 0.0942 0.0811 0.0720 0.0938 0.0920 0.0798 0.0909 0.0809
va: 2.2682 2.2710 5.4374 2.0953 2.1218 3.8553 3.8744 3.9118 3.8629 3.9433 3.9333 3.9409 3.9342 3.8892 3.9568 1.0397 1.0300 1.0128 1.0079 1.0114 1.0285 1.0065 1.0137 1.0063 1.0029 1.0114 1.0011 1.0039 1.0095 1.0204 1.0053 1.0032 1.0100 0.9902 1.0037 1.0094 1.0045 1.0125
dispcorr: -0.018347780 hartree
energy: -1683.324394038796
dipole: -1.43366 1.19469 -0.23897 -5.93522 5.50384 -0.43138 -2.60295 1.59492 -1.00803
magnitude: 1.12220 au
magnitude: 2.85239 debye
