program: Gaussian 09
title: 000006096
version: EM64L-G09RevD.01
frameworkgroup: C1[X(C9H9NO)]
method: RPBEPBE
basis: SDD
operation: Freq
keyword: #pfreq=noraman
keyword: PBEPBE/SDD
title: #p freq=noraman PBEPBE/SDD
converged: YES YES NO YES
title: Mulliken charges:
elementType: O N C C C C C C C C C H H H H H H H H H
charge: -0.231754 -0.206160 0.265318 0.265732 -0.612614 0.125380 -0.375072 -0.334462 -0.644949 -0.248973 -0.214202 0.265171 0.265210 0.240984 0.244326 0.234486 0.272929 0.234483 0.228034 0.226131
chargesum: 0.00000
title: Mulliken charges with hydrogens summed into heavy atoms:
elementType: O N C C C C C C C C C
charge: -0.231754 -0.206160 0.265318 0.265732 -0.082233 0.125380 -0.134088 -0.090136 0.096949 -0.020939 0.011929
polarizability: 1.44649933e+02 4.52601476e+00 1.11449541e+02 -3.47747108e-03 -7.80685994e-04 5.06489287e+01
1716.lowfreq: -0.0005 0.0001 0.0008 3.7653 9.2621 12.3920 111.5558 132.7888 159.2885
frequency: 111.5525 132.7781 159.2879 224.3263 239.9704 299.4297 317.8899 419.8254 476.6609 510.6002 526.1796 574.9717 578.2877 646.9524 714.4479 717.3686 759.6697 821.8042 856.1807 895.5347 921.3889 959.3429 978.1338 1019.2500 1072.1208 1079.5424 1122.9586 1127.3838 1130.1606 1169.7817 1197.3960 1209.7144 1270.1413 1308.9636 1344.4497 1406.2299 1419.5903 1429.8942 1456.0111 1479.8456 1482.4186 1492.5547 1603.4081 1625.9493 1657.7820 2977.0609 3012.6500 3058.5953 3064.2506 3103.4090 3128.5659 3137.1329 3153.1039 3167.2011
redmass: 5.3245 2.7549 1.0829 2.3461 3.0059 4.7817 5.8624 2.8111 7.7839 2.7820 4.7049 3.6087 5.0752 5.8092 5.1934 2.3927 1.5169 3.9172 1.3186 3.3769 1.6165 1.9225 1.3234 2.1469 5.6567 3.0605 1.2862 1.5495 1.1881 1.1115 1.6730 1.6984 2.6947 1.7617 4.7999 3.2935 1.2058 1.2381 2.3287 1.0433 1.2667 2.6517 7.0787 7.8988 10.4616 1.0343 1.0612 1.1021 1.1001 1.0991 1.0855 1.0904 1.0943 1.1003
irintensity: 3.0709 2.7924 0.0015 13.3461 0.9468 1.0111 6.0622 6.4894 3.8199 1.8165 14.5979 0.1939 0.0795 18.1812 0.1421 11.0996 89.0575 3.4888 2.0807 17.9307 0.0008 9.4899 0.1551 15.9879 1.4278 52.9850 0.0470 41.0355 0.0778 0.4128 7.3285 7.9612 57.7260 48.9361 48.7000 7.5517 16.3232 5.7203 19.9738 18.3883 103.8845 57.6727 53.7437 146.3182 279.1685 47.6512 6.4436 29.8464 2.3102 1.2756 1.2396 11.9085 26.6892 18.4232
temp: 298.150 k
press: 1.00000 atm
elementType: 8 7 6 6 6 6 6 6 6 6 6 1 1 1 1 1 1 1 1 1
symmnumber: 1
zpe: 417198.2 jmol-1
zpe.correction: 0.158902 hartree
zpe.thermalcorrener: 0.167949 hartree
zpe.thermalcorrenthalpy: 0.168893 hartree
zpe.thermalcorrgfe: 0.124962 hartree
zpe.sumelectzpe: -477.571816 hartree
zpe.sumelectthermal: -477.562770 hartree
zpe.sumelectthermalent: -477.561826 hartree
zpe.sumelectthermalfe: -477.605757 hartree
dipole: 2.8545 1.2707 -0.0001
dipole: 3.1246
quadrupole: -73.3717 -53.7808 -66.6428
quadrupole: -5.7829 0.0012 0.0003
quadrupole: -8.7733 10.8176 -2.0444 -5.7829 0.0012 0.0003
hfenergy: -477.7307187 hartree
pointgroup: C01 [X(C9H9N1O1)]
dipole: -1.1429708 0.4525513 0.0000477 debye
dipolederiv: -1.5154967 0.2663813 -0.0001312 0.0978832 -0.4903124 0.0000129 0.0005049 -0.0001496 -0.360322 -1.41023 0.0454439 0.0000763 0.5181462 -0.7846411 -0.0000557 -0.0000694 0.0000232 -0.1858491 -0.083435 -0.1207129 -0.0000132 -0.4435794 -0.0146476 0.0000161 0.0000335 -0.0000098 -0.0779577 1.2382136 0.0984275 -0.000038 0.2807262 -0.1030908 0.0000259 0.0000435 0.0000543 0.086263 -0.1478897 -0.1392609 0.0000386 -0.1445558 -0.2357478 -0.0000511 -0.0000042 -0.0002186 0.1408652 1.7380796 -0.3935931 0.0000735 -0.731077 1.0001668 0.0000349 -0.0004268 0.000253 0.1485793 0.1354802 0.0132013 -0.0000008 0.0535208 0.1384705 0.0000223 -0.0000093 0.0000307 -0.1471981 -0.2811924 -0.0663317 0.0000023 0.1566402 0.0500032 -0.0000022 -0.0000484 -0.0000044 -0.2068364 0.070618 0.1878606 -0.0000032 0.1950837 0.4178705 -0.0000071 0.0000036 0.0000013 0.2503167 -0.0838959 0.028683 0.0000028 0.1152059 -0.1412329 -0.0000029 0.0000073 -0.0000061 -0.1899727 0.0974134 0.0320765 0.0000038 -0.1025306 0.1030385 0.0000049 -0.0000107 0.0000061 -0.1547054 0.0355977 0.0230664 -0.0201944 0.0178895 0.0693808 0.0691774 -0.0390563 0.1010601 0.0199663 0.0355472 0.023041 0.0201985 0.0178561 0.0694679 -0.0691215 0.0390475 -0.1009903 0.0199572 0.0828959 -0.0166598 -0.0000009 -0.0480807 -0.1026233 -0.0000132 -0.0000087 -0.0000124 0.1538706 0.0848571 -0.0584961 -0.0000006 -0.040484 -0.0831452 -0.0000042 -0.0000043 -0.0000044 0.173338 0.103812 0.0491602 -0.0858245 -0.0304962 -0.0490372 0.0674255 -0.0313482 0.1127171 -0.064091 -0.0391115 -0.0616922 0.0000146 0.0703661 0.1416398 -0.0000025 0.0000064 0.0000047 0.1298674 0.1038272 0.0491726 0.0857884 -0.0305114 -0.0491021 -0.0674517 0.0313316 -0.1127515 -0.0640828 -0.1155198 -0.0614614 0.0000017 -0.0650484 0.0642656 -0.000004 -0.000001 -0.000003 0.1689511 -0.049571 0.1016937 0.0000063 0.1130456 -0.0007231 -0.0000037 0.0000091 -0.0000005 0.1590403 unknown
polarizability: 144.9700632|-3.1231172|111.1294108|-0.0035071|0.0006346|50.6489287 unknown
InChI: InChI=1S/C9H9NO/c1-10-8-5-3-2-4-7(8)6-9(10)11/h2-5H,6H2,1H3
charge 0 multiplicity 1
20 atoms
O  3.178363 -0.583084 -0.000121
N  1.195885 0.713616 0.000169
C  -0.448841 -0.925561 0.000154
C  -0.203124 0.47689 0.000198
C  0.88726 -1.642366 0.00007
C  1.922305 -0.496733 0.000355
C  -1.767444 -1.401988 0.000138
C  -1.249417 1.418206 0.000206
C  1.830144 2.029704 -0.000057
C  -2.83922 -0.468326 0.000187
C  -2.577799 0.92157 0.00021
H  1.047946 -2.280279 0.888148
H  1.048023 -2.279965 -0.888226
H  -1.972243 -2.47856 0.000074
H  -1.053769 2.495249 0.000214
H  1.547453 2.606977 -0.899873
H  2.921259 1.872429 -0.000119
H  1.54761 2.607209 0.899658
H  -3.874066 -0.826562 0.000183
H  -3.414227 1.629575 0.000231
