program: Orca
programVersion: 5.0.4
elementType: S S P O O C C C C C C C C C C H H H H H H H H H H H H H H H H H H H H H H H
charge: 0
multiplicity: 1
keywords: wb97x-d3
keywords: def2-TZVPP
keywords: def2/J RIJCOSX
keywords: DEFGRID2
keywords: scfconv7
keywords: smallprint printgap noloewdin
keywords: NOSOSCF
formula: C10H23O2PS2
InChI: InChI=1/C10H23O2PS2/c1-6-9(4)14-13(11,12-8-3)15-10(5)7-2/h9-10H,6-8H2,1-5H3
38 atoms
S  1.287232 0.004278 -1.147769
S  -1.927793 -0.239525 -0.767697
P  -0.242687 0.560804 0.147647
O  -0.464592 2.125085 -0.135445
O  0.002797 0.197319 1.562722
C  2.724899 -0.039469 0.006354
C  -1.628562 -2.038238 -0.485025
C  3.161972 1.367179 0.397296
C  -2.110416 -2.458067 0.898851
C  3.809863 -0.832579 -0.707979
C  -2.31332 -2.776795 -1.625195
C  4.312837 1.376879 1.395755
C  -1.755307 -3.901577 1.23377
C  -0.986412 2.98638 0.886581
C  -2.473407 2.808553 1.097985
H  2.39394 -0.582104 0.89351
H  -0.548053 -2.190267 -0.563684
H  2.31431 1.894055 0.837843
H  3.435418 1.922153 -0.503863
H  -1.662835 -1.798895 1.642834
H  -3.192309 -2.311956 0.961025
H  4.668435 -0.97436 -0.051825
H  4.15668 -0.315424 -1.603923
H  3.455601 -1.820032 -1.001602
H  -2.127215 -3.848156 -1.549262
H  -1.941313 -2.443964 -2.59296
H  -3.393775 -2.625583 -1.604533
H  4.523056 2.393407 1.72727
H  5.234846 0.980607 0.970544
H  4.072265 0.787711 2.282065
H  -2.259031 -4.618585 0.585364
H  -2.041318 -4.137251 2.258442
H  -0.680896 -4.07294 1.149204
H  -0.76475 3.995008 0.53936
H  -0.443517 2.826465 1.820358
H  -2.832076 3.561363 1.800735
H  -3.024916 2.927995 0.165908
H  -2.708547 1.828879 1.512707
totalener: -1683.30778211 hartree
nucrepener: 1564.89079430 hartree
electener: -3248.19857641 hartree
oneelecener: -5427.19785415 hartree
twoeener: 2178.99927773 hartree
kineticenergy: 1678.57224412 hartree
xcener: -109.974104252488 hartree
chargesum: -0.0000000
charge: -0.171925 -0.179412 0.681778 -0.340241 -0.531990 0.042896 0.045815 -0.091209 -0.096215 -0.282473 -0.274680 -0.273758 -0.270428 0.039391 -0.263463 0.089025 0.062594 0.068986 0.066483 0.091552 0.060072 0.090386 0.095346 0.100359 0.088750 0.105356 0.092826 0.088569 0.077607 0.087405 0.074580 0.090583 0.080816 0.094086 0.090297 0.085793 0.091175 0.093268
qa: -0.1719 -0.1794 0.6818 -0.3402 -0.5320 0.0429 0.0458 -0.0912 -0.0962 -0.2825 -0.2747 -0.2738 -0.2704 0.0394 -0.2635 0.0890 0.0626 0.0690 0.0665 0.0916 0.0601 0.0904 0.0953 0.1004 0.0888 0.1054 0.0928 0.0886 0.0776 0.0874 0.0746 0.0906 0.0808 0.0941 0.0903 0.0858 0.0912 0.0933
va: 2.3081 2.3052 5.4224 2.0907 2.0567 3.8683 3.8626 3.8765 3.8614 3.9304 3.9255 3.9570 3.9573 3.8806 3.9232 1.0392 1.0479 1.0257 1.0202 1.0341 1.0182 1.0003 1.0032 1.0129 1.0015 1.0130 1.0048 1.0066 1.0008 1.0003 1.0018 1.0065 1.0009 0.9877 1.0052 1.0137 1.0025 1.0146
dispcorr: -0.017211164 hartree
energy: -1683.324993272480
dipole: 6.13298 -5.93979 0.19318 -8.25557 8.20416 -0.05141 8.03143 -8.00529 0.02614
magnitude: 0.20161 au
magnitude: 0.51245 debye
