program: Orca
programVersion: 5.0.4
elementType: S S P O O C C C C C C C C C C H H H H H H H H H H H H H H H H H H H H H H H
charge: 0
multiplicity: 1
keywords: wb97x-d3
keywords: def2-TZVPP
keywords: def2/J RIJCOSX
keywords: DEFGRID2
keywords: scfconv7
keywords: smallprint printgap noloewdin
keywords: NOSOSCF
formula: C10H23O2PS2
InChI: InChI=1/C10H23O2PS2/c1-6-9(4)14-13(11,12-8-3)15-10(5)7-2/h9-10H,6-8H2,1-5H3
38 atoms
S  1.433841 1.16646 -0.79609
S  -0.598814 -1.345525 -1.099984
P  -0.307475 0.381099 0.022915
O  -1.393378 1.427391 -0.531943
O  -0.326575 0.152725 1.487012
C  2.668433 -0.00175 -0.073908
C  -1.569725 -2.370566 0.086381
C  3.104799 0.436579 1.320117
C  -2.999136 -1.858123 0.218314
C  3.808552 -0.124161 -1.073352
C  -1.480771 -3.800999 -0.426097
C  3.818341 1.777781 1.383285
C  -3.817205 -2.633137 1.244052
C  -1.901086 2.464391 0.321225
C  -0.886025 3.549485 0.606191
H  2.169126 -0.971188 -0.000252
H  -1.061492 -2.293901 1.04925
H  3.763706 -0.346236 1.711078
H  2.229408 0.449616 1.970315
H  -2.974762 -0.808412 0.514951
H  -3.485015 -1.890762 -0.760363
H  4.583343 -0.778132 -0.668896
H  4.270795 0.838085 -1.294324
H  3.460763 -0.551238 -2.012564
H  -1.968423 -3.910301 -1.395959
H  -1.968565 -4.482431 0.27093
H  -0.445366 -4.123964 -0.52817
H  3.189988 2.580893 0.996645
H  4.750161 1.779074 0.816697
H  4.068457 2.026195 2.414452
H  -3.987538 -3.66745 0.94523
H  -4.795581 -2.172529 1.37924
H  -3.323495 -2.64238 2.217119
H  -2.267606 2.029322 1.253223
H  -2.756544 2.869792 -0.217906
H  -1.366957 4.355058 1.162249
H  -0.057489 3.180164 1.209429
H  -0.481487 3.969921 -0.313885
totalener: -1683.30744831 hartree
nucrepener: 1570.31137526 hartree
electener: -3253.61882357 hartree
oneelecener: -5438.07127559 hartree
twoeener: 2184.45245202 hartree
kineticenergy: 1678.56550169 hartree
xcener: -109.974098029269 hartree
chargesum: 0.0000000
charge: -0.190941 -0.172060 0.694130 -0.341812 -0.532942 0.050991 0.038853 -0.125200 -0.089570 -0.283830 -0.281657 -0.256342 -0.273310 0.039695 -0.264451 0.077149 0.089430 0.065810 0.095960 0.067849 0.065974 0.089478 0.090471 0.108362 0.094952 0.090421 0.101136 0.078429 0.074977 0.089430 0.077569 0.088430 0.087375 0.089302 0.094967 0.086471 0.092907 0.091595
qa: -0.1909 -0.1721 0.6941 -0.3418 -0.5329 0.0510 0.0389 -0.1252 -0.0896 -0.2838 -0.2817 -0.2563 -0.2733 0.0397 -0.2645 0.0771 0.0894 0.0658 0.0960 0.0678 0.0660 0.0895 0.0905 0.1084 0.0950 0.0904 0.1011 0.0784 0.0750 0.0894 0.0776 0.0884 0.0874 0.0893 0.0950 0.0865 0.0929 0.0916
va: 2.2966 2.3097 5.4114 2.0880 2.0539 3.8619 3.8753 3.8892 3.8775 3.9390 3.9281 3.9329 3.9559 3.8837 3.9284 1.0372 1.0385 1.0101 1.0323 1.0254 1.0205 1.0021 1.0005 1.0122 1.0035 1.0005 1.0130 1.0142 1.0011 1.0066 1.0012 1.0064 1.0004 1.0034 0.9880 1.0138 1.0110 1.0026
dispcorr: -0.017601922 hartree
energy: -1683.325050232893
dipole: 1.65592 -1.74287 -0.08695 -4.28462 4.12753 -0.15709 9.39235 -9.30668 0.08567
magnitude: 0.19894 au
magnitude: 0.50567 debye
