program: Orca
programVersion: 5.0.4
elementType: S S P O O C C C C C C C C C C H H H H H H H H H H H H H H H H H H H H H H H
charge: 0
multiplicity: 1
keywords: wb97x-d3
keywords: def2-TZVPP
keywords: def2/J RIJCOSX
keywords: DEFGRID2
keywords: scfconv7
keywords: smallprint printgap noloewdin
keywords: NOSOSCF
formula: C10H23O2PS2
InChI: InChI=1/C10H23O2PS2/c1-6-9(4)14-13(11,12-8-3)15-10(5)7-2/h9-10H,6-8H2,1-5H3
38 atoms
S  1.130293 1.562375 -0.731013
S  -0.871091 -0.843543 -1.4751
P  -0.469975 0.499214 0.060863
O  -1.645086 1.58918 -0.045644
O  -0.280404 -0.094603 1.406049
C  2.478101 0.322431 -0.486884
C  -1.8452 -2.175516 -0.647132
C  3.060703 0.439165 0.917224
C  -0.933789 -3.111263 0.141076
C  3.494321 0.553261 -1.595095
C  -3.025592 -1.634712 0.144667
C  4.112729 -0.623327 1.213567
C  -1.655841 -4.354875 0.644909
C  -2.065568 2.313872 1.120476
C  -1.059482 3.351197 1.567925
H  2.026611 -0.665219 -0.619999
H  -2.230801 -2.714401 -1.519101
H  2.249779 0.351192 1.640249
H  3.489048 1.437282 1.044467
H  -0.104843 -3.412242 -0.503416
H  -0.497389 -2.565219 0.978043
H  3.034078 0.4735 -2.5786
H  4.289567 -0.190353 -1.539497
H  3.955456 1.538879 -1.51277
H  -2.697323 -1.166717 1.071998
H  -3.705209 -2.446142 0.407526
H  -3.590406 -0.90552 -0.433789
H  5.007379 -0.509186 0.601223
H  3.719286 -1.627568 1.046495
H  4.426573 -0.567801 2.255675
H  -2.14407 -4.894953 -0.168873
H  -2.415247 -4.115669 1.389066
H  -0.950752 -5.040579 1.114469
H  -2.282664 1.616107 1.931699
H  -3.002101 2.787489 0.828043
H  -0.807871 4.038333 0.760731
H  -1.482963 3.933745 2.386799
H  -0.139383 2.893115 1.928705
totalener: -1683.30650646 hartree
nucrepener: 1577.96472236 hartree
electener: -3261.27122882 hartree
oneelecener: -5453.41315838 hartree
twoeener: 2192.14192956 hartree
kineticenergy: 1678.56053212 hartree
xcener: -109.973164684889 hartree
chargesum: -0.0000000
charge: -0.180531 -0.171254 0.689843 -0.341039 -0.536324 0.053373 0.082035 -0.100864 -0.139062 -0.275587 -0.308248 -0.272110 -0.263971 0.035773 -0.261872 0.060265 0.083455 0.091284 0.060634 0.066266 0.095549 0.105934 0.088918 0.093017 0.093350 0.095010 0.107163 0.075540 0.082049 0.090867 0.075357 0.080788 0.089985 0.089216 0.094121 0.091182 0.085833 0.094053
qa: -0.1805 -0.1713 0.6898 -0.3410 -0.5363 0.0534 0.0820 -0.1009 -0.1391 -0.2756 -0.3082 -0.2721 -0.2640 0.0358 -0.2619 0.0603 0.0835 0.0913 0.0606 0.0663 0.0955 0.1059 0.0889 0.0930 0.0933 0.0950 0.1072 0.0755 0.0820 0.0909 0.0754 0.0808 0.0900 0.0892 0.0941 0.0912 0.0858 0.0941
va: 2.3022 2.3076 5.4085 2.0933 2.0336 3.8666 3.8219 3.8665 3.8994 3.9273 3.9304 3.9583 3.9576 3.8952 3.9233 1.0412 1.0123 1.0336 1.0178 1.0170 1.0265 1.0130 1.0009 1.0045 1.0185 0.9997 1.0124 1.0011 1.0006 1.0067 1.0007 1.0009 1.0068 1.0023 0.9882 1.0034 1.0133 1.0127
dispcorr: -0.018127552 hartree
energy: -1683.324634015462
dipole: 6.15864 -6.23315 -0.07451 -10.81946 10.64501 -0.17445 9.90450 -9.83338 0.07112
magnitude: 0.20259 au
magnitude: 0.51495 debye
