program: Orca
programVersion: 5.0.4
elementType: S S P O O C C C C C C C C C C H H H H H H H H H H H H H H H H H H H H H H H
charge: 0
multiplicity: 1
keywords: wb97x-d3
keywords: def2-TZVPP
keywords: def2/J RIJCOSX
keywords: DEFGRID2
keywords: scfconv7
keywords: smallprint printgap noloewdin
keywords: NOSOSCF
formula: C10H23O2PS2
InChI: InChI=1/C10H23O2PS2/c1-6-9(4)14-13(11,12-8-3)15-10(5)7-2/h9-10H,6-8H2,1-5H3
38 atoms
S  1.174585 1.395493 -0.948719
S  -0.969321 -1.03521 -1.146204
P  -0.369759 0.494087 0.12022
O  -1.530983 1.591069 -0.065099
O  -0.077094 0.111045 1.521656
C  2.702885 0.598017 -0.286487
C  -2.066369 -2.076952 -0.085006
C  2.663036 -0.924042 -0.383076
C  -1.291827 -2.921023 0.920286
C  3.043373 1.130043 1.095422
C  -3.188364 -1.278245 0.556927
C  4.02656 -1.56281 -0.148172
C  -0.261653 -3.852706 0.303296
C  -1.502497 2.778554 0.742648
C  -2.850622 3.450554 0.6478
H  3.444951 0.966371 -1.002361
H  -2.498093 -2.739797 -0.842276
H  2.29443 -1.208838 -1.37027
H  1.947501 -1.316108 0.342569
H  -0.820292 -2.265763 1.653016
H  -2.031134 -3.514775 1.46827
H  4.031046 0.78269 1.402746
H  2.317785 0.795973 1.834171
H  3.063152 2.218855 1.10158
H  -2.814621 -0.642221 1.358552
H  -3.916641 -1.963107 0.994949
H  -3.704029 -0.651547 -0.16835
H  4.389718 -1.399741 0.866227
H  4.776517 -1.172143 -0.838365
H  3.971857 -2.640375 -0.301356
H  0.531653 -3.296731 -0.195842
H  -0.71276 -4.519594 -0.433926
H  0.201232 -4.474765 1.069228
H  -0.71065 3.439768 0.379809
H  -1.271595 2.520875 1.779117
H  -3.640372 2.809361 1.038497
H  -2.842257 4.369492 1.234268
H  -3.095147 3.710738 -0.381542
totalener: -1683.30666503 hartree
nucrepener: 1592.55970461 hartree
electener: -3275.86636964 hartree
oneelecener: -5482.64513795 hartree
twoeener: 2206.77876831 hartree
kineticenergy: 1678.56600774 hartree
xcener: -109.973993473323 hartree
chargesum: -0.0000000
charge: -0.199644 -0.165074 0.709487 -0.337915 -0.538359 0.094193 0.062776 -0.138953 -0.142319 -0.289835 -0.280520 -0.267762 -0.244963 0.011220 -0.230678 0.076488 0.083156 0.091630 0.058170 0.098789 0.068436 0.085202 0.115451 0.087898 0.086357 0.088723 0.104436 0.081867 0.078950 0.090028 0.066638 0.075737 0.088337 0.085839 0.100402 0.082585 0.076622 0.086606
qa: -0.1996 -0.1651 0.7095 -0.3379 -0.5384 0.0942 0.0628 -0.1390 -0.1423 -0.2898 -0.2805 -0.2678 -0.2450 0.0112 -0.2307 0.0765 0.0832 0.0916 0.0582 0.0988 0.0684 0.0852 0.1155 0.0879 0.0864 0.0887 0.1044 0.0819 0.0790 0.0900 0.0666 0.0757 0.0883 0.0858 0.1004 0.0826 0.0766 0.0866
va: 2.2981 2.2968 5.3970 2.1086 2.0446 3.8263 3.8516 3.9000 3.8864 3.9442 3.9297 3.9678 3.9483 3.8890 3.9605 1.0121 1.0073 1.0097 1.0217 1.0238 1.0076 1.0029 1.0184 1.0132 1.0218 1.0042 1.0119 1.0013 1.0016 1.0056 1.0151 1.0049 1.0062 0.9982 0.9983 1.0059 1.0084 1.0043
dispcorr: -0.018983842 hartree
energy: -1683.325648876345
dipole: 3.97680 -4.04514 -0.06834 -9.06053 9.09490 0.03437 9.41771 -9.35603 0.06168
magnitude: 0.09827 au
magnitude: 0.24977 debye
