program: Orca
programVersion: 5.0.4
elementType: S S P O O C C C C C C C C C C H H H H H H H H H H H H H H H H H H H H H H H
charge: 0
multiplicity: 1
keywords: wb97x-d3
keywords: def2-TZVPP
keywords: def2/J RIJCOSX
keywords: DEFGRID2
keywords: scfconv7
keywords: smallprint printgap noloewdin
keywords: NOSOSCF
formula: C10H23O2PS2
InChI: InChI=1/C10H23O2PS2/c1-6-9(4)14-13(11,12-8-3)15-10(5)7-2/h9-10H,6-8H2,1-5H3
38 atoms
S  1.079115 0.917821 -1.46016
S  -0.753833 -0.76039 0.877989
P  -0.078094 1.117945 0.25515
O  -1.318762 1.86713 -0.437053
O  0.534684 1.77078 1.431231
C  2.797067 0.849095 -0.774434
C  -1.298138 -1.64284 -0.644705
C  3.030348 -0.28168 0.219981
C  -1.482135 -3.111741 -0.257524
C  3.242402 2.207032 -0.258039
C  -2.577145 -1.066159 -1.226126
C  2.821244 -1.670416 -0.356592
C  -0.208834 -3.851323 0.121528
C  -2.464784 2.222202 0.353995
C  -2.288006 3.56224 1.032468
H  3.355675 0.621081 -1.688265
H  -0.485372 -1.556805 -1.371277
H  2.411732 -0.134034 1.106815
H  4.065228 -0.1861 0.563555
H  -2.215773 -3.180954 0.551228
H  -1.940406 -3.608702 -1.117793
H  2.710374 2.481897 0.64901
H  3.080683 2.985639 -1.001764
H  4.30997 2.175086 -0.031045
H  -3.379534 -1.072485 -0.48767
H  -2.899811 -1.67052 -2.076733
H  -2.443842 -0.048318 -1.582335
H  3.023506 -2.436413 0.391382
H  3.482469 -1.852079 -1.205785
H  1.796437 -1.809682 -0.696642
H  -0.428406 -4.891578 0.361338
H  0.280836 -3.408202 0.988173
H  0.507736 -3.848321 -0.700773
H  -2.676713 1.43644 1.085647
H  -3.30139 2.246326 -0.344636
H  -3.209356 3.829114 1.55157
H  -1.481538 3.536055 1.762646
H  -2.073514 4.345454 0.306602
totalener: -1683.30569828 hartree
nucrepener: 1608.28967549 hartree
electener: -3291.59537377 hartree
oneelecener: -5513.83878884 hartree
twoeener: 2222.24341507 hartree
kineticenergy: 1678.56860927 hartree
xcener: -109.977329106469 hartree
chargesum: -0.0000000
charge: -0.187245 -0.171779 0.709913 -0.338097 -0.532361 0.068634 0.036968 -0.144334 -0.107396 -0.276750 -0.282105 -0.227601 -0.265027 0.021956 -0.236985 0.075212 0.070322 0.090132 0.074375 0.076916 0.068506 0.121493 0.089620 0.080385 0.089510 0.092430 0.097153 0.095316 0.083866 0.033153 0.097010 0.088274 0.072893 0.083977 0.090467 0.078492 0.099357 0.083351
qa: -0.1872 -0.1718 0.7099 -0.3381 -0.5324 0.0686 0.0370 -0.1443 -0.1074 -0.2767 -0.2821 -0.2276 -0.2650 0.0220 -0.2370 0.0752 0.0703 0.0901 0.0744 0.0769 0.0685 0.1215 0.0896 0.0804 0.0895 0.0924 0.0972 0.0953 0.0839 0.0332 0.0970 0.0883 0.0729 0.0840 0.0905 0.0785 0.0994 0.0834
va: 2.2838 2.3031 5.4005 2.1009 2.0945 3.8359 3.8675 3.8750 3.8630 3.9265 3.9228 3.9448 3.9480 3.8878 3.9562 1.0092 1.0230 1.0303 1.0091 1.0150 1.0057 1.0213 1.0127 1.0042 1.0106 1.0108 1.0183 1.0049 1.0103 1.0123 1.0086 1.0100 0.9979 1.0078 0.9847 1.0081 1.0210 1.0056
dispcorr: -0.019935111 hartree
energy: -1683.325633390941
dipole: 1.09619 -1.53044 -0.43424 -11.08042 10.39613 -0.68428 -1.51956 0.80357 -0.71599
magnitude: 1.08141 au
magnitude: 2.74873 debye
