program: Orca
programVersion: 5.0.4
elementType: S S P O O C C C C C C C C C C H H H H H H H H H H H H H H H H H H H H H H H
charge: 0
multiplicity: 1
keywords: wb97x-d3
keywords: def2-TZVPP
keywords: def2/J RIJCOSX
keywords: DEFGRID2
keywords: scfconv7
keywords: smallprint printgap noloewdin
keywords: NOSOSCF
formula: C10H23O2PS2
InChI: InChI=1/C10H23O2PS2/c1-6-9(4)14-13(11,12-8-3)15-10(5)7-2/h9-10H,6-8H2,1-5H3
38 atoms
S  1.681564 -0.216321 -0.335349
S  -1.488775 -0.568902 -0.934349
P  -0.163421 0.529739 0.237619
O  -0.162833 1.981077 -0.452709
O  -0.450619 0.51941 1.690471
C  2.774975 0.662753 0.867891
C  -1.957137 -1.904239 0.252621
C  4.081541 1.00507 0.159167
C  -3.260459 -2.498716 -0.279091
C  2.97315 -0.195591 2.103612
C  -0.844353 -2.925092 0.399432
C  3.934125 2.026741 -0.95714
C  -3.860253 -3.53839 0.659111
C  -1.042199 3.017359 0.006888
C  -2.446702 2.875167 -0.538058
H  2.273956 1.593869 1.144033
H  -2.145815 -1.413576 1.209085
H  4.543828 0.089034 -0.220995
H  4.767575 1.391314 0.919564
H  -3.982618 -1.693242 -0.430451
H  -3.083743 -2.946592 -1.261462
H  3.612975 0.322012 2.821571
H  3.448999 -1.143892 1.851701
H  2.02162 -0.405623 2.587996
H  -0.631995 -3.412757 -0.552679
H  -1.123959 -3.692463 1.122604
H  0.077607 -2.467995 0.754481
H  3.498813 2.954892 -0.583616
H  3.28965 1.660375 -1.755271
H  4.903242 2.268153 -1.393297
H  -4.831811 -3.867451 0.291135
H  -4.00812 -3.130324 1.660139
H  -3.232672 -4.42449 0.749505
H  -0.588778 3.944042 -0.344806
H  -1.049655 3.041743 1.098439
H  -2.443248 2.787069 -1.62396
H  -2.956133 2.004178 -0.12887
H  -3.028029 3.758909 -0.273195
totalener: -1683.30745396 hartree
nucrepener: 1560.46578884 hartree
electener: -3243.77324281 hartree
oneelecener: -5418.40043511 hartree
twoeener: 2174.62719230 hartree
kineticenergy: 1678.57615922 hartree
xcener: -109.973631078352 hartree
chargesum: 0.0000000
charge: -0.172684 -0.183839 0.688634 -0.337873 -0.532062 0.063940 0.044838 -0.115171 -0.108565 -0.268662 -0.266930 -0.236547 -0.269812 0.024195 -0.248418 0.057621 0.088166 0.070172 0.066744 0.082039 0.074361 0.081936 0.083055 0.111031 0.087776 0.087941 0.089463 0.068620 0.085869 0.086219 0.089664 0.082785 0.079418 0.090876 0.095465 0.089729 0.085098 0.084907
qa: -0.1727 -0.1838 0.6886 -0.3379 -0.5321 0.0639 0.0448 -0.1152 -0.1086 -0.2687 -0.2669 -0.2365 -0.2698 0.0242 -0.2484 0.0576 0.0882 0.0702 0.0667 0.0820 0.0744 0.0819 0.0831 0.1110 0.0878 0.0879 0.0895 0.0686 0.0859 0.0862 0.0897 0.0828 0.0794 0.0909 0.0955 0.0897 0.0851 0.0849
va: 2.2892 2.2985 5.4207 2.1032 2.0653 3.8676 3.8775 3.8898 3.8557 3.9429 3.9354 3.9400 3.9528 3.9034 3.9106 1.0364 1.0420 1.0130 1.0082 1.0161 1.0119 1.0081 1.0082 1.0216 1.0092 1.0061 1.0310 1.0055 1.0172 1.0051 1.0062 1.0016 1.0027 0.9881 1.0071 1.0041 1.0162 1.0131
dispcorr: -0.017182045 hartree
energy: -1683.324636008732
dipole: -0.10348 0.05649 -0.04700 -3.84323 4.03242 0.18918 5.00416 -5.04217 -0.03801
magnitude: 0.19860 au
magnitude: 0.50481 debye
