program: Orca
programVersion: 5.0.4
elementType: S S P O O C C C C C C C C C C H H H H H H H H H H H H H H H H H H H H H H H
charge: 0
multiplicity: 1
keywords: wb97x-d3
keywords: def2-TZVPP
keywords: def2/J RIJCOSX
keywords: DEFGRID2
keywords: scfconv7
keywords: smallprint printgap noloewdin
keywords: NOSOSCF
formula: C10H23O2PS2
InChI: InChI=1/C10H23O2PS2/c1-6-9(4)14-13(11,12-8-3)15-10(5)7-2/h9-10H,6-8H2,1-5H3
38 atoms
S  1.560781 0.803581 -0.840946
S  -0.539484 -1.670384 -0.507824
P  -0.233048 0.299392 0.076377
O  -1.27209 1.139779 -0.816501
O  -0.314186 0.523214 1.538326
C  2.763757 0.115212 0.381614
C  -1.721927 -2.239547 0.789061
C  3.885668 1.131096 0.576316
C  -3.087832 -1.56754 0.69124
C  3.273025 -1.234073 -0.09202
C  -1.782399 -3.75585 0.668768
C  3.44757 2.439741 1.213926
C  -3.801335 -1.715093 -0.642586
C  -1.830616 2.365837 -0.321609
C  -0.822006 3.488997 -0.225297
H  2.223822 0.004396 1.324532
H  -1.270389 -1.974393 1.745754
H  4.3780 1.320771 -0.382334
H  4.639425 0.653027 1.209795
H  -3.705522 -1.99293 1.489409
H  -2.981259 -0.509719 0.939372
H  3.97246 -1.646489 0.638405
H  3.794843 -1.146541 -1.045454
H  2.456879 -1.943966 -0.215917
H  -0.804321 -4.206062 0.834269
H  -2.139214 -4.080477 -0.308486
H  -2.465039 -4.153919 1.421449
H  2.960829 2.265526 2.174382
H  2.742919 2.978829 0.58139
H  4.304234 3.090556 1.387773
H  -4.778258 -1.233073 -0.604475
H  -3.96812 -2.759928 -0.907255
H  -3.233793 -1.25093 -1.448587
H  -2.300868 2.191396 0.648632
H  -2.616983 2.615463 -1.033127
H  -1.338524 4.411987 0.042102
H  -0.072513 3.294018 0.541221
H  -0.311213 3.650718 -1.174472
totalener: -1683.30721244 hartree
nucrepener: 1582.64751221 hartree
electener: -3265.95472465 hartree
oneelecener: -5462.76228046 hartree
twoeener: 2196.80755581 hartree
kineticenergy: 1678.57343986 hartree
xcener: -109.975566941358 hartree
chargesum: 0.0000000
charge: -0.193743 -0.181150 0.696952 -0.339561 -0.529178 0.046992 0.037355 -0.109828 -0.122149 -0.251151 -0.284601 -0.245480 -0.256007 0.042722 -0.266233 0.074701 0.101238 0.070126 0.066633 0.073410 0.073144 0.082477 0.084497 0.095129 0.105131 0.091843 0.087925 0.083607 0.071112 0.087724 0.086016 0.075344 0.089270 0.089173 0.093482 0.087589 0.092400 0.093087
qa: -0.1937 -0.1811 0.6970 -0.3396 -0.5292 0.0470 0.0374 -0.1098 -0.1221 -0.2512 -0.2846 -0.2455 -0.2560 0.0427 -0.2662 0.0747 0.1012 0.0701 0.0666 0.0734 0.0731 0.0825 0.0845 0.0951 0.1051 0.0918 0.0879 0.0836 0.0711 0.0877 0.0860 0.0753 0.0893 0.0892 0.0935 0.0876 0.0924 0.0931
va: 2.2902 2.3081 5.4210 2.0794 2.0631 3.8449 3.8993 3.8799 3.8686 3.9385 3.9353 3.9579 3.9350 3.8817 3.9318 1.0442 1.0284 1.0122 1.0083 1.0099 1.0262 1.0065 1.0085 1.0281 1.0107 1.0026 1.0028 1.0036 1.0119 1.0069 1.0059 1.0038 1.0138 1.0006 0.9880 1.0140 1.0088 1.0030
dispcorr: -0.018338430 hartree
energy: -1683.325550867141
dipole: -0.59457 0.48067 -0.11390 -0.30786 0.27307 -0.03479 6.20044 -6.08953 0.11090
magnitude: 0.16274 au
magnitude: 0.41364 debye
