program: Orca
programVersion: 5.0.4
elementType: S S P O O C C C C C C C C C C H H H H H H H H H H H H H H H H H H H H H H H
charge: 0
multiplicity: 1
keywords: wb97x-d3
keywords: def2-TZVPP
keywords: def2/J RIJCOSX
keywords: DEFGRID2
keywords: scfconv7
keywords: smallprint printgap noloewdin
keywords: NOSOSCF
formula: C10H23O2PS2
InChI: InChI=1/C10H23O2PS2/c1-6-9(4)14-13(11,12-8-3)15-10(5)7-2/h9-10H,6-8H2,1-5H3
38 atoms
S  1.738998 -0.225654 -0.677659
S  -1.505657 -0.727737 -0.957693
P  -0.100327 0.425051 0.051697
O  -0.338698 1.832983 -0.681711
O  -0.196001 0.429552 1.530351
C  2.851571 0.017397 0.776107
C  -1.526464 -2.244537 0.093877
C  3.605857 1.338739 0.706056
C  -2.959016 -2.77168 0.120629
C  3.796678 -1.175241 0.802849
C  -0.540918 -3.273397 -0.43043
C  2.728446 2.578836 0.756365
C  -3.956995 -1.853587 0.808859
C  -1.089285 2.874607 -0.039611
C  -2.572515 2.58503 0.029749
H  2.213237 -0.0014 1.660981
H  -1.246056 -1.929429 1.101464
H  4.226832 1.355063 -0.194066
H  4.299222 1.351944 1.553707
H  -3.286676 -2.993569 -0.899665
H  -2.932431 -3.734551 0.640112
H  4.404593 -1.226862 -0.101636
H  3.254017 -2.114277 0.899861
H  4.476892 -1.08812 1.651901
H  0.473664 -2.879073 -0.452258
H  -0.800863 -3.58772 -1.441704
H  -0.547936 -4.157798 0.210237
H  2.130298 2.680052 -0.148058
H  3.338225 3.477521 0.84784
H  2.04977 2.548986 1.610305
H  -3.648023 -1.634838 1.832259
H  -4.942693 -2.316809 0.851537
H  -4.058591 -0.902863 0.285643
H  -0.899044 3.761896 -0.642289
H  -0.686631 3.057425 0.958548
H  -2.981208 2.358025 -0.95452
H  -2.791493 1.750218 0.694768
H  -3.090804 3.463425 0.416587
totalener: -1683.30743921 hartree
nucrepener: 1583.83995551 hartree
electener: -3267.14739473 hartree
oneelecener: -5465.14979216 hartree
twoeener: 2198.00239743 hartree
kineticenergy: 1678.57036912 hartree
xcener: -109.974340379489 hartree
chargesum: -0.0000000
charge: -0.177999 -0.188763 0.710946 -0.345352 -0.533712 0.032665 0.050725 -0.100248 -0.113971 -0.260667 -0.247404 -0.275278 -0.244581 0.032712 -0.262397 0.092431 0.076073 0.064796 0.064598 0.071416 0.066164 0.090974 0.099261 0.084127 0.085487 0.084301 0.082884 0.086157 0.091993 0.080151 0.080191 0.087561 0.073783 0.095313 0.094024 0.092117 0.091955 0.087567
qa: -0.1780 -0.1888 0.7109 -0.3454 -0.5337 0.0327 0.0507 -0.1002 -0.1140 -0.2607 -0.2474 -0.2753 -0.2446 0.0327 -0.2624 0.0924 0.0761 0.0648 0.0646 0.0714 0.0662 0.0910 0.0993 0.0841 0.0855 0.0843 0.0829 0.0862 0.0920 0.0802 0.0802 0.0876 0.0738 0.0953 0.0940 0.0921 0.0920 0.0876
va: 2.2965 2.3001 5.4074 2.0821 2.0601 3.8570 3.8423 3.8707 3.8801 3.9370 3.9327 3.9418 3.9561 3.8822 3.9378 1.0446 1.0434 1.0148 1.0085 1.0121 1.0079 1.0041 1.0104 1.0052 1.0339 1.0106 1.0070 1.0132 1.0095 1.0083 1.0034 1.0070 1.0121 0.9872 0.9984 1.0033 1.0098 1.0132
dispcorr: -0.018477217 hartree
energy: -1683.325916430091
dipole: -0.81567 0.86632 0.05064 -2.36873 2.32430 -0.04443 8.47403 -8.30454 0.16949
magnitude: 0.18238 au
magnitude: 0.46358 debye
