program: Orca
programVersion: 5.0.4
elementType: S S P O O C C C C C C C C C C H H H H H H H H H H H H H H H H H H H H H H H
charge: 0
multiplicity: 1
keywords: wb97x-d3
keywords: def2-TZVPP
keywords: def2/J RIJCOSX
keywords: DEFGRID2
keywords: scfconv7
keywords: smallprint printgap noloewdin
keywords: NOSOSCF
formula: C10H23O2PS2
InChI: InChI=1/C10H23O2PS2/c1-6-9(4)14-13(11,12-8-3)15-10(5)7-2/h9-10H,6-8H2,1-5H3
38 atoms
S  1.705793 0.18863 -0.938142
S  -1.42915 -0.648447 -1.009329
P  -0.088393 0.544836 0.045957
O  -0.492363 2.014239 -0.463728
O  -0.087438 0.353508 1.515635
C  2.977645 0.901979 0.197073
C  -1.400703 -2.182932 0.017544
C  3.28776 -0.019659 1.371353
C  -2.753937 -2.870832 -0.14325
C  2.655563 2.320675 0.636286
C  -0.245841 -3.081635 -0.384334
C  3.812143 -1.389681 0.974253
C  -3.931096 -2.093116 0.424584
C  -1.353086 2.850877 0.322279
C  -2.794383 2.390199 0.329764
H  3.846905 0.932626 -0.468052
H  -1.282704 -1.859482 1.053513
H  2.398049 -0.116378 1.995024
H  4.0405 0.488339 1.983573
H  -2.924865 -3.104931 -1.198273
H  -2.678988 -3.835867 0.367207
H  2.385652 2.955218 -0.20578
H  3.531089 2.755058 1.121949
H  1.842153 2.335751 1.360908
H  -0.239035 -3.980086 0.236302
H  0.713934 -2.582241 -0.260715
H  -0.33055 -3.389662 -1.426721
H  4.716292 -1.312079 0.367614
H  3.075154 -1.950016 0.399384
H  4.05887 -1.979031 1.857063
H  -4.08406 -1.149471 -0.098226
H  -3.777236 -1.864189 1.480112
H  -4.85192 -2.670168 0.342221
H  -1.269556 3.837044 -0.13354
H  -0.96906 2.921386 1.342208
H  -3.183652 2.278701 -0.681456
H  -2.914465 1.440599 0.849457
H  -3.403886 3.131934 0.847334
totalener: -1683.30673433 hartree
nucrepener: 1589.94908820 hartree
electener: -3273.25582252 hartree
oneelecener: -5477.40197859 hartree
twoeener: 2204.14615607 hartree
kineticenergy: 1678.57055850 hartree
xcener: -109.975194317428 hartree
chargesum: 0.0000000
charge: -0.174849 -0.192107 0.699566 -0.339037 -0.534235 0.066765 0.045078 -0.136556 -0.114718 -0.286073 -0.233916 -0.251170 -0.248995 0.034164 -0.259973 0.083338 0.084306 0.096528 0.064567 0.072576 0.067136 0.106626 0.091518 0.083808 0.083028 0.070937 0.085899 0.073619 0.078943 0.086792 0.076207 0.077942 0.089692 0.093475 0.090484 0.092383 0.088849 0.087405
qa: -0.1748 -0.1921 0.6996 -0.3390 -0.5342 0.0668 0.0451 -0.1366 -0.1147 -0.2861 -0.2339 -0.2512 -0.2490 0.0342 -0.2600 0.0833 0.0843 0.0965 0.0646 0.0726 0.0671 0.1066 0.0915 0.0838 0.0830 0.0709 0.0859 0.0736 0.0789 0.0868 0.0762 0.0779 0.0897 0.0935 0.0905 0.0924 0.0888 0.0874
va: 2.2904 2.2962 5.4099 2.0915 2.0450 3.8318 3.8525 3.8966 3.8719 3.9270 3.9402 3.9517 3.9542 3.8982 3.9278 1.0085 1.0427 1.0237 1.0064 1.0123 1.0073 1.0114 1.0043 1.0204 1.0090 1.0293 1.0113 1.0042 1.0077 1.0061 1.0104 1.0029 1.0075 0.9878 1.0013 1.0033 1.0101 1.0136
dispcorr: -0.018770514 hartree
energy: -1683.325504839705
dipole: -1.05118 1.02172 -0.02946 -6.36739 6.49205 0.12467 9.55516 -9.40630 0.14886
magnitude: 0.19639 au
magnitude: 0.49919 debye
