program: Orca
programVersion: 5.0.4
elementType: S S P O O C C C C C C C C C C H H H H H H H H H H H H H H H H H H H H H H H
charge: 0
multiplicity: 1
keywords: wb97x-d3
keywords: def2-TZVPP
keywords: def2/J RIJCOSX
keywords: DEFGRID2
keywords: scfconv7
keywords: smallprint printgap noloewdin
keywords: NOSOSCF
formula: C10H23O2PS2
InChI: InChI=1/C10H23O2PS2/c1-6-9(4)14-13(11,12-8-3)15-10(5)7-2/h9-10H,6-8H2,1-5H3
38 atoms
S  1.291895 0.372399 1.241954
S  -0.902487 -0.633922 -1.144379
P  -0.576434 0.726132 0.40518
O  -0.394296 2.067142 -0.460437
O  -1.607283 0.737202 1.46207
C  2.420692 0.356887 -0.219412
C  -1.342373 -2.138052 -0.169635
C  3.466009 -0.737468 -0.009609
C  -2.463076 -2.869073 -0.903768
C  3.016306 1.735289 -0.44949
C  -0.11706 -3.009528 0.0386
C  4.367294 -0.55439 1.202866
C  -3.773185 -2.100775 -0.975155
C  -1.436402 3.056431 -0.487319
C  -2.634914 2.622555 -1.301195
H  1.811413 0.069403 -1.079685
H  -1.722722 -1.787465 0.792565
H  4.078851 -0.773875 -0.915722
H  2.956414 -1.701446 0.052196
H  -2.126319 -3.143385 -1.908254
H  -2.624777 -3.813612 -0.375173
H  3.712563 1.704696 -1.290638
H  3.560038 2.093695 0.423756
H  2.241746 2.463111 -0.679943
H  0.657298 -2.474709 0.586677
H  0.299968 -3.340031 -0.913287
H  -0.382917 -3.896797 0.617016
H  4.944067 0.368741 1.149014
H  5.078998 -1.376542 1.274238
H  3.79846 -0.538241 2.133682
H  -4.549713 -2.703313 -1.445873
H  -3.669749 -1.181927 -1.551327
H  -4.12187 -1.826149 0.021109
H  -0.969787 3.938227 -0.925016
H  -1.733118 3.305772 0.532986
H  -3.344381 3.448398 -1.36419
H  -2.350098 2.343652 -2.315063
H  -3.14761 1.778666 -0.841037
totalener: -1683.30601689 hartree
nucrepener: 1583.11980981 hartree
electener: -3266.42582670 hartree
oneelecener: -5463.50574964 hartree
twoeener: 2197.07992293 hartree
kineticenergy: 1678.57340696 hartree
xcener: -109.976500934430 hartree
chargesum: 0.0000000
charge: -0.176408 -0.205664 0.703243 -0.342954 -0.519779 0.027354 0.073131 -0.125458 -0.114293 -0.275840 -0.264742 -0.250153 -0.243949 0.027064 -0.250276 0.086735 0.078681 0.071333 0.083899 0.069261 0.067186 0.086181 0.087652 0.103137 0.081503 0.086854 0.089262 0.078993 0.089166 0.083983 0.086601 0.074339 0.083004 0.085192 0.097201 0.087048 0.086434 0.095077
qa: -0.1764 -0.2057 0.7032 -0.3430 -0.5198 0.0274 0.0731 -0.1255 -0.1143 -0.2758 -0.2647 -0.2502 -0.2439 0.0271 -0.2503 0.0867 0.0787 0.0713 0.0839 0.0693 0.0672 0.0862 0.0877 0.1031 0.0815 0.0869 0.0893 0.0790 0.0892 0.0840 0.0866 0.0743 0.0830 0.0852 0.0972 0.0870 0.0864 0.0951
va: 2.3005 2.2736 5.4158 2.0942 2.1032 3.8612 3.8183 3.9091 3.8872 3.9497 3.9369 3.9339 3.9558 3.9082 3.8973 1.0391 1.0445 1.0079 1.0103 1.0124 1.0079 1.0030 1.0052 1.0212 1.0332 1.0070 1.0114 1.0019 1.0061 1.0082 1.0059 1.0129 1.0042 0.9894 1.0042 1.0140 1.0050 1.0144
dispcorr: -0.018483087 hartree
energy: -1683.324499976045
dipole: 4.01546 -3.50627 0.50919 -7.83209 7.63546 -0.19663 -6.67603 5.67648 -0.99954
magnitude: 1.13887 au
magnitude: 2.89477 debye
