program: Orca
programVersion: 5.0.4
elementType: S S P O O C C C C C C C C C C H H H H H H H H H H H H H H H H H H H H H H H
charge: 0
multiplicity: 1
keywords: wb97x-d3
keywords: def2-TZVPP
keywords: def2/J RIJCOSX
keywords: DEFGRID2
keywords: scfconv7
keywords: smallprint printgap noloewdin
keywords: NOSOSCF
formula: C10H23O2PS2
InChI: InChI=1/C10H23O2PS2/c1-6-9(4)14-13(11,12-8-3)15-10(5)7-2/h9-10H,6-8H2,1-5H3
38 atoms
S  1.255188 1.609906 -0.188265
S  -0.659944 -0.857638 -1.057175
P  -0.203927 0.347379 0.592216
O  -1.425779 1.356102 0.819676
O  0.123636 -0.427777 1.803563
C  2.658614 0.419455 -0.346334
C  -1.425555 -2.310401 -0.216954
C  3.417242 0.338079 0.973481
C  -2.798927 -1.964314 0.347533
C  3.505688 0.886677 -1.51982
C  -1.460235 -3.423274 -1.254035
C  4.526031 -0.706562 0.958206
C  -3.445136 -3.124593 1.095239
C  -2.025473 2.14313 -0.213242
C  -1.70862 3.608995 -0.020643
H  2.222714 -0.554283 -0.587378
H  -0.750661 -2.58267 0.596489
H  2.710422 0.098909 1.768441
H  3.83116 1.322381 1.208734
H  -2.703776 -1.121522 1.033807
H  -3.44818 -1.630756 -0.466849
H  2.922618 0.9274 -2.438493
H  4.335121 0.198759 -1.683976
H  3.927144 1.876663 -1.338155
H  -1.82357 -4.347006 -0.80367
H  -0.468749 -3.624446 -1.658068
H  -2.12213 -3.174357 -2.085115
H  4.138438 -1.691857 0.693482
H  4.980581 -0.791234 1.944831
H  5.323348 -0.461169 0.256354
H  -2.79127 -3.498908 1.884495
H  -3.690195 -3.95918 0.43857
H  -4.372905 -2.802834 1.567502
H  -3.10047 1.968636 -0.149182
H  -1.704714 1.802453 -1.201741
H  -2.020993 3.955265 0.963677
H  -0.643934 3.810832 -0.133593
H  -2.240102 4.19781 -0.768825
totalener: -1683.30671693 hartree
nucrepener: 1564.40615061 hartree
electener: -3247.71286754 hartree
oneelecener: -5426.01875124 hartree
twoeener: 2178.30588370 hartree
kineticenergy: 1678.56132433 hartree
xcener: -109.973211745357 hartree
chargesum: 0.0000000
charge: -0.217670 -0.211775 0.706132 -0.327000 -0.517225 0.048014 0.062667 -0.089939 -0.111660 -0.273337 -0.280272 -0.270833 -0.275570 0.003250 -0.213281 0.069767 0.089674 0.094580 0.061032 0.084188 0.060858 0.103354 0.090155 0.093081 0.091136 0.101251 0.092637 0.082057 0.091472 0.073839 0.089379 0.077182 0.089579 0.094294 0.088866 0.090053 0.080954 0.079107
qa: -0.2177 -0.2118 0.7061 -0.3270 -0.5172 0.0480 0.0627 -0.0899 -0.1117 -0.2733 -0.2803 -0.2708 -0.2756 0.0033 -0.2133 0.0698 0.0897 0.0946 0.0610 0.0842 0.0609 0.1034 0.0902 0.0931 0.0911 0.1013 0.0926 0.0821 0.0915 0.0738 0.0894 0.0772 0.0896 0.0943 0.0889 0.0901 0.0810 0.0791
va: 2.2918 2.2709 5.4301 2.0966 2.1146 3.8730 3.8538 3.8603 3.8668 3.9279 3.9266 3.9556 3.9711 3.8836 3.9428 1.0430 1.0387 1.0339 1.0185 1.0263 1.0177 1.0129 1.0013 1.0043 1.0007 1.0127 1.0042 1.0008 1.0067 1.0013 1.0003 1.0001 1.0063 0.9944 1.0085 1.0051 1.0124 1.0095
dispcorr: -0.017013904 hartree
energy: -1683.323730839155
dipole: 1.78223 -2.00113 -0.21890 -9.00689 8.98215 -0.02474 -2.65672 1.62038 -1.03634
magnitude: 1.05949 au
magnitude: 2.69301 debye
