program: Orca
programVersion: 5.0.4
elementType: S S P O O C C C C C C C C C C H H H H H H H H H H H H H H H H H H H H H H H
charge: 0
multiplicity: 1
keywords: wb97x-d3
keywords: def2-TZVPP
keywords: def2/J RIJCOSX
keywords: DEFGRID2
keywords: scfconv7
keywords: smallprint printgap noloewdin
keywords: NOSOSCF
formula: C10H23O2PS2
InChI: InChI=1/C10H23O2PS2/c1-6-9(4)14-13(11,12-8-3)15-10(5)7-2/h9-10H,6-8H2,1-5H3
38 atoms
S  1.282629 0.097141 -1.093834
S  -1.902559 -0.503324 -0.906453
P  -0.412813 0.66059 -0.045099
O  -0.767765 2.104731 -0.647345
O  -0.284781 0.597915 1.429909
C  2.612585 0.65265 0.065978
C  -1.529497 -2.136576 -0.128673
C  3.828234 0.97361 -0.801723
C  -2.163962 -2.239383 1.252961
C  2.870046 -0.409953 1.118291
C  -2.011952 -3.198409 -1.105317
C  5.001641 1.523947 -0.000914
C  -1.79033 -3.526423 1.978709
C  -1.706418 2.944579 0.043574
C  -1.002352 3.871793 1.007266
H  2.264886 1.571491 0.543313
H  -0.440656 -2.201487 -0.04265
H  3.536849 1.700097 -1.563035
H  4.14078 0.072354 -1.338065
H  -1.844663 -1.385835 1.850667
H  -3.250359 -2.165128 1.153615
H  1.966285 -0.620557 1.68472
H  3.630365 -0.075312 1.825921
H  3.219126 -1.336035 0.659297
H  -3.093714 -3.150805 -1.240735
H  -1.768035 -4.193776 -0.733711
H  -1.541569 -3.084982 -2.08083
H  5.412887 0.787429 0.688664
H  4.709513 2.399452 0.58121
H  5.807896 1.828061 -0.668074
H  -2.178691 -3.516041 2.996781
H  -0.707095 -3.642851 2.045154
H  -2.19121 -4.414582 1.490099
H  -2.457472 2.342817 0.563192
H  -2.221624 3.505819 -0.735838
H  -0.517047 3.311509 1.804665
H  -0.253222 4.4752 0.494873
H  -1.725098 4.550441 1.461418
totalener: -1683.30832202 hartree
nucrepener: 1553.91899506 hartree
electener: -3237.22731707 hartree
oneelecener: -5405.24097512 hartree
twoeener: 2168.01365804 hartree
kineticenergy: 1678.56616600 hartree
xcener: -109.971191368825 hartree
chargesum: 0.0000000
charge: -0.167246 -0.184782 0.691114 -0.338606 -0.536512 0.068007 0.050817 -0.112068 -0.100902 -0.287349 -0.275288 -0.268110 -0.270624 0.037638 -0.250741 0.067901 0.062098 0.085758 0.071482 0.093963 0.060107 0.111934 0.086121 0.082970 0.093054 0.089422 0.105398 0.079170 0.080482 0.090881 0.090808 0.081233 0.075137 0.081927 0.094321 0.096348 0.082507 0.081627
qa: -0.1672 -0.1848 0.6911 -0.3386 -0.5365 0.0680 0.0508 -0.1121 -0.1009 -0.2873 -0.2753 -0.2681 -0.2706 0.0376 -0.2507 0.0679 0.0621 0.0858 0.0715 0.0940 0.0601 0.1119 0.0861 0.0830 0.0931 0.0894 0.1054 0.0792 0.0805 0.0909 0.0908 0.0812 0.0751 0.0819 0.0943 0.0963 0.0825 0.0816
va: 2.3050 2.3022 5.4246 2.1030 2.0451 3.8808 3.8692 3.8685 3.8592 3.9369 3.9267 3.9543 3.9566 3.9009 3.9267 1.0329 1.0408 1.0167 1.0127 1.0362 1.0188 1.0269 1.0051 1.0068 1.0048 1.0011 1.0129 1.0023 1.0013 1.0064 1.0068 1.0008 1.0013 1.0061 0.9914 1.0196 1.0038 1.0118
dispcorr: -0.016872876 hartree
energy: -1683.325194891642
dipole: 9.42412 -9.20953 0.21459 -5.78574 5.80642 0.02068 10.86407 -10.84727 0.01680
magnitude: 0.21624 au
magnitude: 0.54964 debye
