program: Orca
programVersion: 5.0.4
elementType: S S P O O C C C C C C C C C C H H H H H H H H H H H H H H H H H H H H H H H
charge: 0
multiplicity: 1
keywords: wb97x-d3
keywords: def2-TZVPP
keywords: def2/J RIJCOSX
keywords: DEFGRID2
keywords: scfconv7
keywords: smallprint printgap noloewdin
keywords: NOSOSCF
formula: C10H23O2PS2
InChI: InChI=1/C10H23O2PS2/c1-6-9(4)14-13(11,12-8-3)15-10(5)7-2/h9-10H,6-8H2,1-5H3
38 atoms
S  1.324291 1.344572 -0.604856
S  -0.65097 -1.176897 -1.089455
P  -0.269257 0.339529 0.273394
O  -1.460092 1.389648 0.02481
O  -0.089033 -0.114986 1.670656
C  2.71095 0.214104 -0.149143
C  -1.593501 -2.358163 -0.032943
C  3.240859 0.547561 1.240219
C  -3.032532 -1.888005 0.147216
C  3.752165 0.343514 -1.250755
C  -1.477227 -3.717583 -0.706579
C  4.314488 -0.424224 1.714865
C  -3.84064 -2.780516 1.080335
C  -1.5779 2.533702 0.883597
C  -2.695613 3.402082 0.356907
H  2.306211 -0.801994 -0.159023
H  -1.086428 -2.382206 0.933567
H  2.409068 0.532707 1.944409
H  3.633005 1.56845 1.236136
H  -3.028074 -0.872564 0.546587
H  -3.514401 -1.827108 -0.832273
H  4.156607 1.356043 -1.297354
H  3.3311 0.100657 -2.225188
H  4.584044 -0.337341 -1.069895
H  -1.966132 -4.48212 -0.10264
H  -0.436123 -4.012756 -0.830317
H  -1.950328 -3.717578 -1.689955
H  5.217915 -0.379922 1.106266
H  3.951439 -1.453242 1.700216
H  4.605863 -0.197847 2.740185
H  -3.991573 -3.779939 0.672421
H  -4.827376 -2.352967 1.257333
H  -3.351079 -2.885036 2.049939
H  -0.634695 3.088974 0.896348
H  -1.782657 2.204856 1.904972
H  -3.643883 2.865123 0.348202
H  -2.810914 4.278198 0.994832
H  -2.486443 3.746936 -0.655426
totalener: -1683.30924041 hartree
nucrepener: 1549.22237264 hartree
electener: -3232.53161305 hartree
oneelecener: -5395.83531161 hartree
twoeener: 2163.30369855 hartree
kineticenergy: 1678.56591302 hartree
xcener: -109.970057339386 hartree
chargesum: 0.0000000
charge: -0.192450 -0.166067 0.684721 -0.336098 -0.528533 0.053285 0.031939 -0.099577 -0.085889 -0.273739 -0.279087 -0.270954 -0.272197 0.014286 -0.229196 0.066364 0.091661 0.092299 0.058568 0.067609 0.063966 0.091469 0.105701 0.089139 0.089412 0.101859 0.093606 0.074255 0.082988 0.090056 0.076876 0.088807 0.086685 0.087223 0.104590 0.084347 0.076157 0.085919
qa: -0.1924 -0.1661 0.6847 -0.3361 -0.5285 0.0533 0.0319 -0.0996 -0.0859 -0.2737 -0.2791 -0.2710 -0.2722 0.0143 -0.2292 0.0664 0.0917 0.0923 0.0586 0.0676 0.0640 0.0915 0.1057 0.0891 0.0894 0.1019 0.0936 0.0743 0.0830 0.0901 0.0769 0.0888 0.0867 0.0872 0.1046 0.0843 0.0762 0.0859
va: 2.2895 2.3059 5.4331 2.0987 2.0781 3.8589 3.8802 3.8737 3.8735 3.9264 3.9247 3.9564 3.9557 3.8668 3.9579 1.0404 1.0407 1.0348 1.0182 1.0294 1.0197 1.0049 1.0129 1.0014 1.0009 1.0133 1.0034 1.0016 1.0009 1.0066 1.0014 1.0062 1.0004 1.0016 1.0009 1.0048 1.0083 1.0053
dispcorr: -0.016446233 hartree
energy: -1683.325686643252
dipole: 0.12985 -0.21217 -0.08232 -7.66244 7.63848 -0.02396 6.40203 -6.47968 -0.07765
magnitude: 0.11567 au
magnitude: 0.29401 debye
