program: Orca
programVersion: 5.0.3
elementType: S O O O O N N C C C C C C C H H H H H H H H H H H H H H
charge: 0
multiplicity: 1
keywords: wb97x-d3
keywords: def2-TZVPP
keywords: def2/J RIJCOSX
keywords: DEFGRID2
keywords: scfconv7
keywords: smallprint printgap noloewdin
keywords: NOSOSCF
formula: C7H14N2O4S
InChI: InChI=1/C7H14N2O4S/c1-5(6(2)14(4,11)12)9-13-7(10)8-3/h6,8H,1-4H3
28 atoms
S  -2.429945 0.648876 -0.403959
O  -3.41809 0.591792 -1.482671
O  -2.930695 0.730613 0.969986
O  1.814471 -0.524542 1.023657
O  3.927865 -0.185642 1.48325
N  0.85604 -0.501555 0.032537
N  3.247148 0.158361 -0.650423
C  -1.367459 -0.819415 -0.570316
C  -0.294933 -0.812467 0.48173
C  -2.240609 -2.066703 -0.550995
C  -1.347216 2.024462 -0.69866
C  -0.594167 -1.167523 1.898518
C  3.069362 -0.169745 0.623564
C  4.553334 0.543164 -1.135157
H  -0.899907 -0.708525 -1.551643
H  -2.835861 -2.15491 0.355873
H  -2.910195 -2.079285 -1.407933
H  -1.600452 -2.945123 -0.620689
H  -0.844816 1.900151 -1.655818
H  -1.969696 2.918643 -0.723405
H  -0.618745 2.111124 0.103828
H  -0.35829 -0.33542 2.563293
H  -1.636906 -1.429023 2.042727
H  0.012219 -2.016775 2.215884
H  2.465071 0.134466 -1.284686
H  4.461796 0.799736 -2.185783
H  5.275066 -0.26814 -1.045137
H  4.938759 1.413633 -0.605703
elementType: S O N C H
totalener: -1083.85253382 hartree
nucrepener: 1111.43526647 hartree
electener: -2195.28780029 hartree
oneelecener: -3692.29562021 hartree
twoeener: 1497.00781992 hartree
cpcmener: -0.05187548 hartree
kineticenergy: 1080.09192267 hartree
xcener: -82.439198660605 hartree
chargesum: -0.0000000
charge: 0.829357 -0.567490 -0.563127 -0.172467 -0.545054 -0.191452 -0.217265 0.012922 0.110940 -0.285580 -0.251745 -0.245856 0.465686 -0.159290 0.116503 0.110051 0.115648 0.120522 0.144049 0.146461 0.142354 0.127816 0.097247 0.124182 0.194573 0.115210 0.113644 0.112162
qa: 0.8294 -0.5675 -0.5631 -0.1725 -0.5451 -0.1915 -0.2173 0.0129 0.1109 -0.2856 -0.2517 -0.2459 0.4657 -0.1593 0.1165 0.1101 0.1156 0.1205 0.1440 0.1465 0.1424 0.1278 0.0972 0.1242 0.1946 0.1152 0.1136 0.1122
va: 5.4893 1.9037 1.8924 2.0553 1.9668 2.8328 3.1736 3.8375 3.8026 3.9405 3.8878 3.9504 4.3844 3.8902 1.0375 1.0047 1.0134 0.9987 1.0046 1.0120 1.0037 0.9980 1.0146 1.0012 1.0182 0.9983 0.9910 0.9923
dispcorr: -0.012625253 hartree
energy: -1083.865159069819
dipole: 3.65928 -2.98483 0.67445 -2.11920 2.04378 -0.07542 -3.94476 1.71409 -2.23067
magnitude: 2.33162 au
magnitude: 5.92650 debye
