program: Orca
programVersion: 5.0.3
elementType: S O O O O N N C C C C C C C H H H H H H H H H H H H H H
charge: 0
multiplicity: 1
keywords: wb97x-d3
keywords: def2-TZVPP
keywords: def2/J RIJCOSX
keywords: DEFGRID2
keywords: scfconv7
keywords: smallprint printgap noloewdin
keywords: NOSOSCF
formula: C7H14N2O4S
InChI: InChI=1/C7H14N2O4S/c1-5(6(2)14(4,11)12)9-13-7(10)8-3/h6,8H,1-4H3
28 atoms
S  -2.44088 0.596852 -0.30354
O  -2.583043 0.136402 -1.676747
O  -3.61356 0.930059 0.488731
O  1.868162 -0.897816 -0.538477
O  4.037604 -0.634162 -0.779458
N  0.774815 -0.489997 0.173949
N  2.98593 0.6177 0.79505
C  -1.519209 -0.686236 0.622459
C  -0.290967 -1.102766 -0.144769
C  -1.287222 -0.26002 2.062735
C  -1.360782 2.023482 -0.321722
C  -0.434945 -2.193295 -1.153645
C  3.05346 -0.300203 -0.184699
C  4.184322 1.239319 1.298691
H  -2.235559 -1.515303 0.601828
H  -0.814694 -1.072944 2.612174
H  -0.633246 0.605994 2.139841
H  -2.232297 -0.027521 2.547836
H  -1.892482 2.781715 -0.895058
H  -1.192518 2.388515 0.687784
H  -0.420134 1.787284 -0.810409
H  -1.335112 -2.033482 -1.743868
H  0.417381 -2.273573 -1.820667
H  -0.549091 -3.147582 -0.633474
H  2.111501 0.751056 1.27065
H  3.908564 2.127362 1.861897
H  4.83197 1.54254 0.479926
H  4.753488 0.577732 1.953907
totalener: -1083.82289565 hartree
nucrepener: 1120.29774154 hartree
electener: -2204.12063719 hartree
oneelecener: -3709.97631654 hartree
twoeener: 1505.85567935 hartree
kineticenergy: 1080.15367978 hartree
xcener: -82.442834747435 hartree
chargesum: 0.0000000
charge: 0.809992 -0.481158 -0.471350 -0.162303 -0.373444 -0.197406 -0.246148 -0.020918 0.100004 -0.295009 -0.298464 -0.235285 0.399758 -0.145875 0.114879 0.106645 0.075199 0.131764 0.140574 0.120776 0.133304 0.121250 0.112066 0.094933 0.155468 0.089916 0.113840 0.106994
qa: 0.8100 -0.4812 -0.4713 -0.1623 -0.3734 -0.1974 -0.2461 -0.0209 0.1000 -0.2950 -0.2985 -0.2353 0.3998 -0.1459 0.1149 0.1066 0.0752 0.1318 0.1406 0.1208 0.1333 0.1213 0.1121 0.0949 0.1555 0.0899 0.1138 0.1070
va: 5.5790 1.9966 2.0161 2.0737 2.1554 2.8498 3.1325 3.8696 3.8467 3.9770 3.9095 3.9338 4.4376 3.9148 1.0223 1.0029 1.0059 1.0141 1.0185 1.0065 1.0114 1.0181 1.0201 1.0013 1.0400 0.9989 1.0032 0.9905
dispcorr: -0.012823288 hartree
energy: -1083.835718938152
dipole: 4.35393 -4.16502 0.18891 2.27770 -1.79188 0.48583 7.82360 -6.23722 1.58638
magnitude: 1.66982 au
magnitude: 4.24436 debye
