program: Orca
programVersion: 5.0.3
elementType: S O O N N C C C C C C C H H H H H H H H H H H H H H
charge: 0
multiplicity: 1
keywords: wb97x-d3
keywords: def2-TZVPP
keywords: def2/J RIJCOSX
keywords: DEFGRID2
keywords: scfconv7
keywords: smallprint printgap noloewdin
keywords: NOSOSCF
formula: C7H14N2O2S
InChI: InChI=1/C7H14N2O2S/c1-5(6(2)12-4)9-11-7(10)8-3/h6,8H,1-4H3
26 atoms
S  -3.072289 0.634414 -0.061551
O  1.347142 -0.444387 -0.932361
O  3.504701 -0.094828 -1.078276
N  0.278907 -0.579974 -0.053037
N  2.554821 0.006178 0.975953
C  -2.048848 -0.866864 0.180265
C  -0.822671 -0.72832 -0.672823
C  -1.809297 -1.190797 1.641488
C  -0.979643 -0.758093 -2.157551
C  -2.061177 1.894487 0.742575
C  2.538782 -0.169068 -0.341937
C  3.790724 0.29284 1.667217
H  -2.663724 -1.654555 -0.264939
H  -1.251334 -2.122561 1.73969
H  -1.24985 -0.413305 2.15867
H  -2.764022 -1.317323 2.149555
H  -2.021111 -0.901731 -2.433276
H  -0.633751 0.169419 -2.614832
H  -0.395969 -1.572257 -2.589849
H  -1.060954 1.951363 0.31574
H  -1.990847 1.74033 1.817484
H  -2.556649 2.848763 0.568501
H  1.698253 -0.087753 1.497792
H  4.521825 -0.505469 1.541051
H  3.571669 0.385931 2.726539
H  4.236212 1.228627 1.330157
elementType: S O N C H
totalener: -933.37999685 hartree
nucrepener: 841.93925029 hartree
electener: -1775.31924714 hartree
oneelecener: -2949.66833441 hartree
twoeener: 1174.34908726 hartree
cpcmener: -0.03246721 hartree
kineticenergy: 930.36456467 hartree
xcener: -70.164588132172 hartree
chargesum: -0.0000000
charge: -0.168734 -0.186308 -0.554700 -0.233644 -0.223309 0.101333 0.134263 -0.293220 -0.248043 -0.280624 0.467108 -0.160029 0.118720 0.108019 0.086122 0.102017 0.090663 0.117659 0.120689 0.116842 0.116842 0.133197 0.197778 0.111955 0.113566 0.111839
qa: -0.1687 -0.1863 -0.5547 -0.2336 -0.2233 0.1013 0.1343 -0.2932 -0.2480 -0.2806 0.4671 -0.1600 0.1187 0.1080 0.0861 0.1020 0.0907 0.1177 0.1207 0.1168 0.1168 0.1332 0.1978 0.1120 0.1136 0.1118
va: 2.1635 2.0437 1.9554 2.7896 3.1657 3.8166 3.8173 3.9581 3.9622 4.0042 4.3913 3.8939 1.0021 1.0062 1.0015 1.0112 1.0147 0.9997 1.0024 1.0006 0.9926 0.9990 1.0136 0.9916 0.9986 0.9913
dispcorr: -0.009938746 hartree
energy: -933.389935596588
dipole: -2.19233 0.59364 -1.59868 0.76525 -0.86069 -0.09544 7.46197 -5.53278 1.92918
magnitude: 2.50732 au
magnitude: 6.37309 debye
