program: Orca
programVersion: 5.0.3
elementType: S O O O O O N N C C C C C C C C C C C C C C C C C C C C H H H H H H H H H H H H H H H H H H H H H H H H H H H H H H
charge: 0
multiplicity: 1
keywords: wb97x-d3
keywords: def2-TZVPP
keywords: def2/J RIJCOSX
keywords: DEFGRID2
keywords: scfconv7
keywords: smallprint printgap noloewdin
keywords: NOSOSCF
formula: C20H30N2O5S
InChI: InChI=1/C20H30N2O5S/c1-7-25-17(23)11-12-22(14(2)3)28-21(6)19(24)26-16-10-8-9-15-13-20(4,5)27-18(15)16/h8-10,14H,7,11-13H2,1-6H3
58 atoms
S  -1.487565 1.357645 1.336114
O  0.625114 -2.279004 -0.842916
O  0.446103 -0.707598 1.541611
O  -0.968035 -2.43134 1.818708
O  0.821577 4.105304 0.292098
O  0.164224 3.966949 -1.839774
N  -1.571108 1.525911 -0.308157
N  -1.749508 -0.296755 1.756949
C  1.011013 -3.230554 -1.888072
C  2.472363 -3.623325 -1.5602
C  2.675828 -3.054688 -0.189496
C  1.56766 -2.280091 0.110647
C  0.870218 -2.517209 -3.21575
C  0.073922 -4.418259 -1.779733
C  3.725979 -3.144377 0.705301
C  1.494413 -1.568596 1.295711
C  3.650041 -2.443793 1.906945
C  2.540284 -1.660533 2.20035
C  -2.875483 1.379775 -0.977167
C  -0.39945 1.177846 -1.108516
C  -3.041773 0.020634 -1.650582
C  -3.108637 2.516363 -1.963754
C  0.833702 1.967956 -0.7034
C  -0.77713 -1.24128 1.702826
C  0.567363 3.442483 -0.825854
C  -3.113087 -0.763032 1.977395
C  0.547564 5.517336 0.334768
C  -0.918378 5.79807 0.572633
H  2.610268 -4.705018 -1.595605
H  3.17522 -3.185992 -2.273806
H  -0.157038 -2.188564 -3.382641
H  1.140954 -3.190942 -4.028867
H  1.525953 -1.647184 -3.269746
H  0.315703 -5.153351 -2.547724
H  -0.965596 -4.117385 -1.917567
H  0.166739 -4.908725 -0.808866
H  4.597625 -3.74329 0.474763
H  4.460028 -2.503681 2.621003
H  2.487521 -1.107076 3.129369
H  -3.625689 1.465103 -0.188606
H  -0.17578 0.110273 -1.07384
H  -0.630771 1.401897 -2.149873
H  -4.068995 -0.098003 -1.996853
H  -2.391567 -0.083731 -2.521324
H  -2.82331 -0.8035 -0.970449
H  -2.3948 2.499839 -2.788822
H  -3.042915 3.487781 -1.473008
H  -4.105384 2.428549 -2.397787
H  1.645094 1.709225 -1.388725
H  1.164323 1.70892 0.30054
H  -3.739876 0.096584 2.198124
H  -3.158484 -1.436654 2.832265
H  -3.52086 -1.275415 1.105037
H  1.146758 5.886153 1.165163
H  0.906503 6.000209 -0.574853
H  -1.267374 5.328611 1.492483
H  -1.545917 5.456688 -0.250324
H  -1.061072 6.874246 0.673405
elementType: S O N C H
totalener: -1664.19538518 hartree
nucrepener: 3134.41545410 hartree
electener: -4798.61083928 hartree
oneelecener: -8513.05147208 hartree
twoeener: 3714.44063279 hartree
cpcmener: -0.04401200 hartree
kineticenergy: 1657.92796658 hartree
xcener: -140.801605806405 hartree
chargesum: 0.0000000
charge: 0.012759 -0.371127 -0.317699 -0.509575 -0.285988 -0.500077 -0.132088 -0.154774 0.364975 -0.138432 -0.111710 0.350918 -0.315448 -0.320359 -0.171488 0.042564 -0.168895 -0.197941 0.103895 -0.138929 -0.291160 -0.297632 -0.108672 0.487186 0.409844 -0.174932 0.041817 -0.256740 0.099534 0.095648 0.099910 0.111785 0.101373 0.102741 0.100075 0.107249 0.153052 0.159265 0.150798 0.062084 0.091543 0.127599 0.108035 0.092220 0.087560 0.085675 0.089412 0.101783 0.116813 0.087059 0.104503 0.118090 0.117480 0.111005 0.092267 0.087586 0.084242 0.103323
qa: 0.0128 -0.3711 -0.3177 -0.5096 -0.2860 -0.5001 -0.1321 -0.1548 0.3650 -0.1384 -0.1117 0.3509 -0.3154 -0.3204 -0.1715 0.0426 -0.1689 -0.1979 0.1039 -0.1389 -0.2912 -0.2976 -0.1087 0.4872 0.4098 -0.1749 0.0418 -0.2567 0.0995 0.0956 0.0999 0.1118 0.1014 0.1027 0.1001 0.1072 0.1531 0.1593 0.1508 0.0621 0.0915 0.1276 0.1080 0.0922 0.0876 0.0857 0.0894 0.1018 0.1168 0.0871 0.1045 0.1181 0.1175 0.1110 0.0923 0.0876 0.0842 0.1033
va: 2.3573 2.0608 2.0767 1.9956 2.1253 1.9832 2.9946 3.1722 3.7152 4.0389 3.7047 3.8439 3.9446 3.9780 3.9337 3.7622 3.8802 3.9867 3.8708 3.9369 3.8994 3.9333 3.8609 4.2626 4.1576 3.8835 3.8387 3.9198 1.0043 1.0064 1.0045 1.0040 1.0029 1.0046 1.0062 0.9986 0.9955 0.9885 0.9983 1.0068 1.0317 1.0049 1.0063 1.0003 1.0118 1.0085 1.0080 1.0077 1.0166 1.0489 1.0105 1.0006 0.9842 0.9968 1.0114 1.0048 1.0113 1.0090
dispcorr: -0.035282966 hartree
energy: -1664.230668145821
dipole: -12.70270 12.98630 0.28360 3.36213 -3.53068 -0.16855 -20.02227 18.95704 -1.06524
magnitude: 1.11515 au
magnitude: 2.83449 debye
