program: Orca
programVersion: 5.0.3
elementType: S O O O O O N N C C C C C C C C C C C C C C C C C C C C H H H H H H H H H H H H H H H H H H H H H H H H H H H H H H
charge: 0
multiplicity: 1
keywords: wb97x-d3
keywords: def2-TZVPP
keywords: def2/J RIJCOSX
keywords: DEFGRID2
keywords: scfconv7
keywords: smallprint printgap noloewdin
keywords: NOSOSCF
formula: C20H30N2O5S
InChI: InChI=1/C20H30N2O5S/c1-7-25-17(23)11-12-22(14(2)3)28-21(6)19(24)26-16-10-8-9-15-13-20(4,5)27-18(15)16/h8-10,14H,7,11-13H2,1-6H3
58 atoms
S  -1.404234 1.378865 1.344253
O  0.571647 -2.337625 -0.852894
O  0.528482 -0.697808 1.493696
O  -0.88406 -2.410709 1.839671
O  0.640696 4.126637 0.461203
O  0.21987 4.089814 -1.734464
N  -1.47573 1.538841 -0.301506
N  -1.659731 -0.275485 1.770273
C  0.891123 -3.326161 -1.88607
C  2.361543 -3.732552 -1.618892
C  2.647976 -3.111984 -0.286088
C  1.564047 -2.317439 0.048232
C  0.696339 -2.647916 -3.225345
C  -0.057388 -4.494522 -1.696433
C  3.747976 -3.176633 0.54873
C  1.560083 -1.567995 1.21238
C  3.745105 -2.432724 1.726578
C  2.656856 -1.634072 2.056815
C  -2.767639 1.354952 -0.984356
C  -0.282383 1.236085 -1.087932
C  -2.891347 -0.016095 -1.641872
C  -3.018139 2.474621 -1.985611
C  0.915604 2.069202 -0.655653
C  -0.691694 -1.223254 1.702231
C  0.557049 3.527571 -0.716479
C  -3.02111 -0.741222 2.008129
C  0.223176 5.49904 0.569332
C  -1.278996 5.617607 0.683214
H  2.478858 -4.817276 -1.6139
H  3.032295 -3.340707 -2.38753
H  0.916882 -3.34762 -4.03164
H  1.3624 -1.791097 -3.334283
H  -0.332549 -2.306333 -3.351326
H  0.136136 -5.256469 -2.451881
H  -1.097777 -4.181478 -1.794918
H  0.073504 -4.957149 -0.716329
H  4.601653 -3.789514 0.28966
H  4.595176 -2.471642 2.393702
H  2.660384 -1.04939 2.967979
H  -3.528886 1.430781 -0.205352
H  -0.019994 0.177011 -1.060752
H  -0.506957 1.464018 -2.129932
H  -3.906985 -0.160246 -2.01194
H  -2.21744 -0.120307 -2.494568
H  -2.674258 -0.825649 -0.943979
H  -2.985067 3.452247 -1.504021
H  -4.00692 2.355876 -2.430293
H  -2.294585 2.469575 -2.802231
H  1.734281 1.880976 -1.353911
H  1.260174 1.78686 0.337217
H  -3.06454 -1.380565 2.887523
H  -3.42435 -1.287644 1.155729
H  -3.653061 0.121173 2.193969
H  0.705274 5.860426 1.475799
H  0.610496 6.080737 -0.267846
H  -1.792464 5.281933 -0.217369
H  -1.539984 6.664169 0.842546
H  -1.658166 5.047943 1.531797
elementType: S O N C H
totalener: -1664.19489044 hartree
nucrepener: 3143.04489133 hartree
electener: -4807.23978177 hartree
oneelecener: -8530.26435025 hartree
twoeener: 3723.02456848 hartree
cpcmener: -0.04418162 hartree
kineticenergy: 1657.93266556 hartree
xcener: -140.803069782678 hartree
chargesum: -0.0000000
charge: 0.011045 -0.373064 -0.317396 -0.508996 -0.283382 -0.499283 -0.129073 -0.151634 0.365307 -0.138880 -0.115293 0.355179 -0.315422 -0.321284 -0.173540 0.048334 -0.166089 -0.202519 0.102101 -0.137304 -0.289562 -0.299930 -0.107307 0.484560 0.407478 -0.173048 0.042913 -0.265374 0.099768 0.095739 0.111353 0.101769 0.099315 0.103562 0.100014 0.107364 0.153028 0.159210 0.150288 0.062269 0.084790 0.129275 0.107404 0.091424 0.085443 0.092329 0.102285 0.087481 0.115932 0.088431 0.118846 0.116316 0.103177 0.110461 0.092715 0.087239 0.106366 0.087871
qa: 0.0110 -0.3731 -0.3174 -0.5090 -0.2834 -0.4993 -0.1291 -0.1516 0.3653 -0.1389 -0.1153 0.3552 -0.3154 -0.3213 -0.1735 0.0483 -0.1661 -0.2025 0.1021 -0.1373 -0.2896 -0.2999 -0.1073 0.4846 0.4075 -0.1730 0.0429 -0.2654 0.0998 0.0957 0.1114 0.1018 0.0993 0.1036 0.1000 0.1074 0.1530 0.1592 0.1503 0.0623 0.0848 0.1293 0.1074 0.0914 0.0854 0.0923 0.1023 0.0875 0.1159 0.0884 0.1188 0.1163 0.1032 0.1105 0.0927 0.0872 0.1064 0.0879
va: 2.3614 2.0593 2.0759 1.9965 2.1253 1.9844 2.9923 3.1742 3.7147 4.0437 3.7054 3.8395 3.9436 3.9773 3.9341 3.7646 3.8766 3.9863 3.8714 3.9377 3.9047 3.9342 3.8585 4.2671 4.1615 3.8822 3.8346 3.9216 1.0040 1.0061 1.0044 1.0024 1.0047 1.0047 1.0060 0.9987 0.9956 0.9884 0.9988 1.0068 1.0344 1.0041 1.0068 0.9993 1.0126 1.0053 1.0080 1.0075 1.0179 1.0474 0.9998 0.9852 1.0116 0.9970 1.0118 1.0089 1.0100 1.0056
dispcorr: -0.035729046 hartree
energy: -1664.230619482852
dipole: -13.90179 13.99273 0.09094 2.44129 -2.70212 -0.26083 -19.67103 18.61831 -1.05271
magnitude: 1.08835 au
magnitude: 2.76636 debye
