program: Orca
programVersion: 5.0.3
elementType: S O O O O O N N C C C C C C C C C C C C C C C C C C C C H H H H H H H H H H H H H H H H H H H H H H H H H H H H H H
charge: 0
multiplicity: 1
keywords: wb97x-d3
keywords: def2-TZVPP
keywords: def2/J RIJCOSX
keywords: DEFGRID2
keywords: scfconv7
keywords: smallprint printgap noloewdin
keywords: NOSOSCF
formula: C20H30N2O5S
InChI: InChI=1/C20H30N2O5S/c1-7-25-17(23)11-12-22(14(2)3)28-21(6)19(24)26-16-10-8-9-15-13-20(4,5)27-18(15)16/h8-10,14H,7,11-13H2,1-6H3
58 atoms
S  -1.425572 1.37048 1.346096
O  0.612162 -2.299819 -0.857011
O  0.500095 -0.711947 1.516719
O  -0.921175 -2.420994 1.843977
O  0.715017 4.149036 0.361731
O  0.194541 4.038604 -1.809434
N  -1.505736 1.544796 -0.298197
N  -1.691751 -0.284694 1.759937
C  0.956201 -3.275938 -1.894963
C  2.418364 -3.687042 -1.595345
C  2.659277 -3.109494 -0.23438
C  1.572004 -2.310973 0.079084
C  0.794413 -2.58348 -3.231039
C  0.002337 -4.445119 -1.741765
C  3.723995 -3.210831 0.641691
C  1.532787 -1.588689 1.25932
C  3.683462 -2.497494 1.837708
C  2.593761 -1.691484 2.144916
C  -2.805557 1.381754 -0.972195
C  -0.323959 1.220784 -1.093785
C  -2.955582 0.014751 -1.632586
C  -3.045454 2.507068 -1.969728
C  0.888342 2.042774 -0.683734
C  -0.724659 -1.233993 1.707302
C  0.564213 3.507162 -0.786143
C  -3.055262 -0.747383 1.992787
C  0.350011 5.539138 0.430106
C  -1.140832 5.717172 0.600957
H  2.540133 -4.770796 -1.625016
H  3.111697 -3.265274 -2.327476
H  1.03775 -3.274471 -4.038312
H  1.460743 -1.723974 -3.314559
H  -0.231816 -2.243452 -3.380506
H  0.21165 -5.197856 -2.50211
H  -1.034962 -4.128445 -1.859581
H  0.110303 -4.920058 -0.764753
H  4.579438 -3.829043 0.401629
H  4.504902 -2.567058 2.537631
H  2.568623 -1.130242 3.07041
H  -3.559859 1.467859 -0.187547
H  -0.074572 0.159083 -1.056697
H  -0.556188 1.438592 -2.136222
H  -3.976805 -0.11331 -1.993031
H  -2.291908 -0.09594 -2.492315
H  -2.743252 -0.800392 -0.939906
H  -2.991614 3.483551 -1.487642
H  -4.039908 2.405578 -2.405985
H  -2.329149 2.490242 -2.79259
H  1.703789 1.819247 -1.375704
H  1.228415 1.780773 0.316394
H  -3.692257 0.119853 2.139968
H  -3.109537 -1.358514 2.892847
H  -3.443436 -1.32289 1.151861
H  0.882784 5.918507 1.300106
H  0.721201 6.072096 -0.445883
H  -1.70373 5.361062 -0.261584
H  -1.359134 6.778152 0.724667
H  -1.502028 5.197649 1.48875
elementType: S O N C H
totalener: -1664.19525667 hartree
nucrepener: 3136.51993940 hartree
electener: -4800.71519607 hartree
oneelecener: -8517.24370849 hartree
twoeener: 3716.52851242 hartree
cpcmener: -0.04414532 hartree
kineticenergy: 1657.92661240 hartree
xcener: -140.801516873486 hartree
chargesum: 0.0000000
charge: 0.011487 -0.371843 -0.318989 -0.509658 -0.284523 -0.499961 -0.130734 -0.152557 0.364329 -0.136039 -0.114388 0.347876 -0.314334 -0.320895 -0.173614 0.050354 -0.167516 -0.199548 0.102509 -0.137412 -0.289267 -0.298978 -0.107967 0.487153 0.409020 -0.173859 0.043071 -0.262591 0.099648 0.095366 0.111307 0.101174 0.099470 0.103135 0.099919 0.107527 0.153057 0.159333 0.150736 0.062450 0.087719 0.128212 0.107335 0.091616 0.086177 0.090717 0.102444 0.086474 0.116099 0.087451 0.102929 0.120002 0.115925 0.110843 0.092310 0.086396 0.105047 0.088052
qa: 0.0115 -0.3718 -0.3190 -0.5097 -0.2845 -0.5000 -0.1307 -0.1526 0.3643 -0.1360 -0.1144 0.3479 -0.3143 -0.3209 -0.1736 0.0504 -0.1675 -0.1995 0.1025 -0.1374 -0.2893 -0.2990 -0.1080 0.4872 0.4090 -0.1739 0.0431 -0.2626 0.0996 0.0954 0.1113 0.1012 0.0995 0.1031 0.0999 0.1075 0.1531 0.1593 0.1507 0.0625 0.0877 0.1282 0.1073 0.0916 0.0862 0.0907 0.1024 0.0865 0.1161 0.0875 0.1029 0.1200 0.1159 0.1108 0.0923 0.0864 0.1050 0.0881
va: 2.3600 2.0605 2.0772 1.9959 2.1251 1.9835 2.9922 3.1740 3.7165 4.0360 3.7052 3.8471 3.9432 3.9777 3.9350 3.7646 3.8780 3.9896 3.8726 3.9379 3.9023 3.9337 3.8618 4.2625 4.1580 3.8820 3.8353 3.9217 1.0042 1.0064 1.0042 1.0029 1.0046 1.0047 1.0062 0.9986 0.9956 0.9884 0.9983 1.0063 1.0339 1.0047 1.0067 0.9998 1.0121 1.0063 1.0080 1.0081 1.0176 1.0478 1.0113 0.9990 0.9858 0.9969 1.0117 1.0094 1.0097 1.0050
dispcorr: -0.035472785 hartree
energy: -1664.230729453681
dipole: -13.44322 13.61102 0.16779 2.98158 -3.19047 -0.20889 -19.86763 18.81153 -1.05610
magnitude: 1.08956 au
magnitude: 2.76945 debye
