program: Gaussian 09
title: 000065021
version: EM64L-G09RevD.01
frameworkgroup: C1[X(C7H18N4O)]
method: RPBEPBE
basis: SDD
operation: Freq
keyword: #p
keyword: freq=noraman
keyword: PBEPBE/SDD
title: #p freq=noraman PBEPBE/SDD
converged: YES YES NO NO
title: Mulliken charges:
elementType: O N N N N C C C C C C C H H H H H H H H H H H H H H H H H H
charge: -0.290448 -0.551503 -0.330383 -0.544434 -0.598622 -0.148805 -0.377129 -0.367865 -0.559472 -0.419922 0.234304 -0.357206 0.219239 0.183951 0.212548 0.246773 0.155123 0.236195 0.234579 0.212132 0.198275 0.260206 0.264865 0.312648 0.255404 0.265443 0.221965 0.256957 0.288013 0.287170
chargesum: 0.00000
title: Mulliken charges with hydrogens summed into heavy atoms:
elementType: O N N N N C C C C C C C
charge: -0.290448 -0.026431 -0.017735 -0.023588 -0.023439 0.070434 0.019370 0.034031 -0.088698 -0.009516 0.234304 0.121716
polarizability: 1.29668031e+02 6.95483107e-01 1.03239939e+02 -7.14314532e+00 3.14367091e+00 9.12209061e+01
1716.lowfreq: -14.7948 -8.2187 0.0002 0.0004 0.0005 4.8520 10.8510 34.4668 54.6162
frequency: 9.2183 34.0913 54.5925 59.8106 74.7264 95.5244 119.2717 154.7757 177.0039 192.4011 221.7409 234.4411 255.6247 270.0609 340.5658 368.2181 398.6031 413.1983 463.1963 491.8546 549.2236 607.6112 627.2516 631.9922 667.8628 713.6110 738.7505 806.1595 834.3112 852.9538 935.1141 958.0735 972.3001 1000.1541 1023.7238 1042.6356 1046.7706 1087.6262 1090.4876 1110.6414 1138.6349 1157.8543 1178.8619 1185.1633 1240.2754 1258.6965 1265.5236 1293.8028 1300.9446 1309.0693 1314.9997 1333.3712 1347.1178 1362.8981 1369.3504 1386.1849 1452.9579 1456.7955 1463.7255 1472.7181 1475.4089 1494.3891 1603.1711 1637.8428 1639.1307 1643.3431 2943.7404 2951.9629 2976.6162 2978.4415 2980.0567 3007.9240 3012.7486 3022.7552 3031.4319 3048.5345 3077.6528 3421.7983 3442.3339 3524.5921 3539.6866 3547.2978 3567.3362 3661.2727
redmass: 4.9523 4.3663 2.8822 1.7312 3.7321 3.3328 3.0904 2.7286 1.6059 1.8134 1.2562 2.4277 1.1163 3.0358 3.0229 2.8940 2.4235 2.6943 2.0871 1.3299 2.1628 2.1396 1.4932 1.7429 1.6558 5.1332 1.1371 1.6698 2.0582 1.5978 1.6418 2.3230 1.7099 2.3982 3.0936 1.7365 1.7933 2.9476 3.4675 3.8409 1.5554 1.9041 1.3383 1.4846 1.6009 1.3643 1.3481 1.1896 1.3377 1.2701 1.3127 1.1819 1.2775 1.4301 1.3429 1.3092 1.0985 1.0861 1.1978 1.4326 1.1613 1.1609 6.3868 1.0927 1.1042 1.0881 1.0637 1.0628 1.0638 1.0580 1.0818 1.0904 1.0621 1.0996 1.1062 1.1045 1.1029 1.0446 1.0445 1.0458 1.0774 1.0964 1.0969 1.1008
irintensity: 2.5935 0.8856 4.7884 5.0219 1.2291 4.8953 3.1032 1.6664 39.2795 29.4927 48.1237 20.5210 52.0622 13.4791 16.2874 5.5724 4.6850 17.7949 33.7251 222.4996 24.1662 68.6531 318.5738 230.9967 110.7313 8.3581 8.6077 0.6614 2.5519 7.9246 0.2913 2.1713 3.1839 12.1672 16.7425 10.8941 4.6539 6.3450 9.1501 125.3815 52.7702 1.3824 16.5481 4.6806 35.8853 1.5509 16.8095 4.3535 5.7285 67.8335 5.5178 0.5516 9.5868 6.2047 16.1884 17.9175 15.4382 3.0441 75.0169 133.2245 50.5229 48.5206 166.0151 29.0656 56.7944 27.6509 30.4741 24.9565 35.5673 47.9504 78.4736 22.0215 25.5761 2.5331 26.6419 79.8702 27.0536 3.1451 1.6266 2.8483 22.2457 0.1064 0.1002 7.5701
temp: 298.150 k
press: 1.00000 atm
elementType: 8 7 7 7 7 6 6 6 6 6 6 6 1 1 1 1 1 1 1 1 1 1 1 1 1 1 1 1 1 1
symmnumber: 1
zpe: 689315.7 jmol-1
zpe.correction: 0.262546 hartree
zpe.thermalcorrener: 0.278386 hartree
zpe.thermalcorrenthalpy: 0.279331 hartree
zpe.thermalcorrgfe: 0.216900 hartree
zpe.sumelectzpe: -570.764056 hartree
zpe.sumelectthermal: -570.748216 hartree
zpe.sumelectthermalent: -570.747272 hartree
zpe.sumelectthermalfe: -570.809703 hartree
dipole: -2.5686 1.9519 1.3193
dipole: 3.4854
quadrupole: -63.1395 -82.2570 -72.6693
quadrupole: 12.2655 -7.9166 -0.6631
quadrupole: 9.5491 -9.5684 0.0193 12.2655 -7.9166 -0.6631
hfenergy: -571.0266029 hartree
pointgroup: C01 [X(C7H18N4O1)]
dipole: -1.011245 0.8138464 0.4420134 debye
polarizability: 129.5009879|0.0947966|103.7853884|-7.6262405|1.68956|90.8424999 unknown
InChI: InChI=1S/C7H18N4O/c8-3-1-2-6(10)4-7(12)11-5-9/h6,11H,1-5,8-10H2
charge 0 multiplicity 1
30 atoms
O  -0.781744 -1.3729 -0.913835
N  1.056198 2.840347 -0.187144
N  -2.513069 0.064821 -0.309809
N  4.351791 -1.683781 0.049245
N  -4.05458 -0.632766 1.414449
C  0.342942 1.601733 0.216832
C  1.23603 0.531436 0.91777
C  2.324415 -0.107633 0.025744
C  -0.386912 1.056392 -1.047455
C  3.3076 -0.995544 0.8375
C  -1.229692 -0.189468 -0.766979
C  -3.444748 -0.991025 0.138459
H  -0.432159 1.915195 0.946402
H  1.714511 1.018064 1.79508
H  0.589693 -0.275833 1.317723
H  1.841495 -0.73063 -0.751474
H  2.911106 0.682061 -0.493277
H  -1.004681 1.877979 -1.453334
H  0.360684 0.78424 -1.813536
H  2.730358 -1.767762 1.382393
H  3.809756 -0.37906 1.60963
H  1.775846 2.671665 -0.901151
H  1.44811 3.355793 0.610284
H  -2.824534 1.029135 -0.171838
H  4.997674 -1.043909 -0.42617
H  3.976188 -2.38159 -0.602118
H  -4.254834 -1.118599 -0.605361
H  -2.845767 -1.92293 0.146581
H  -5.056827 -0.785316 1.509313
H  -3.510552 -0.825215 2.255676
